{"text_format":"1","workbook":"xlsx","n_sheets":3,"sheets":["Prep","Info","Routes"],"not_rendered":{"charts":0,"images":0,"macros":1,"external_links":0,"defined_names":0,"comments":1,"pivot_tables":0},"unopened":[],"bounds":{"document_bytes":16777216,"sheet_cells":100000,"rows_first":2000,"rows_last":500,"rows_between":2000,"halvings":0,"cell_chars":16384,"cell_head_chars":4096},"cells_cut":0,"cells_raw":0,"read":"whole","date_system":"1900"}

{"sheet":"Prep","index":0,"n_rows":766,"n_cols":25,"rows_kept":766,"cut":false,"hidden":false,"merged":[[1,6,2,6],[11,19,11,23],[13,17,13,18],[1,10,1,12],[1,16,1,17],[13,1,13,6],[13,12,13,13],[13,8,13,10],[2,2,2,4],[3,2,3,4],[4,2,4,4],[1,2,1,4],[12,1,12,4],[9,2,9,4],[8,2,8,3],[11,1,11,4]]}
[]
[null,null,"Bonii-Prep v1.15b Ex",null,null,null,"Enable\nmacros!",null,null,null,"Symbol Assignment",null,null,"Custom",null,null,"Chg Symbol",null,null,"Enter location information into yellow areas."]
[null,null,"For Microsoft Excel",null,null,null,null,null,null,null,"Pts/pct","Count","Min Points"," Symbol",null,null,"Code","ChgTo",null,"Do not enter these characters in text:  <   &    They will corrupt the GPX file."]
[null,null,"Enter location data and export to a GPX file",null,null,null,null,null,null,null,0,{"$f":"IF(M4=\"\",\"\",COUNTIF($T$17:$T$766,\">=\"&M4)-COUNTIF($T$17:$T$766,\">=\"&M5))","v":2},{"$f":"IF(K4=\"\",\"\",IF(K4>=1,K4,_xlfn.PERCENTILE.INC(T$17:T$766, K4)))","v":0},"anchor",".pts.suffix",null,"R","red",null,"Characters that Basecamp may not import may be changed to ^ during export."]
[null,null,"<turnlink.net/rally>",null,null,null,null," ",null,null,500,{"$f":"IF(M5=\"\",\"\",COUNTIF($T$17:$T$766,\">=\"&M5)-COUNTIF($T$17:$T$766,\">=\"&M6))","v":2},{"$f":"IF(K5=\"\",\"\",IF(K5>=1,K5,_xlfn.PERCENTILE.INC(T$17:T$766, K5)))","v":500},"circle, green",".pts.comment",null,"B","blue",null,"Enter symbol assignment criteria in blue columns."]
[null,null,null,null,null,null,null,null,null,null,0.2,{"$f":"IF(M6=\"\",\"\",COUNTIF($T$17:$T$766,\">=\"&M6)-COUNTIF($T$17:$T$766,\">=\"&M7))","v":4},575,"circle, blue","name only",null,"S","~square",null,"To export, select green rows, all green columns, and click Export to GPX"]
[null,"  Export",null,null,null,"Check",null,null,null,null,0.4,{"$f":"IF(M7=\"\",\"\",COUNTIF($T$17:$T$766,\">=\"&M7)-COUNTIF($T$17:$T$766,\">=\"&M8))","v":4},704,"circle, red",1,null,"T","~triangle",null,"To clear entries, select data in yellow or blue areas, then Clear Contents."]
[null,null,null,null,null,null,false,null,null,null,0.6,4,865,"custom 1",{"$f":"Q4&R4&Q5&R5&Q6&R6&Q7&R7&Q8&R8&Q9&R9&Q10&R10&Q11&R11","v":"RredBblueS~squareT~triangleF~~flag, redX~~sad face@jump+10#jump+20"},null,"F","~~flag, red",null,"See more information on the Info sheet and red Note cells."]
[null,"File name:","BPExport15b_1",null,null,true,true,null,null,null,0.8,2,1022,"custom 2",null,null,"X","~~sad face"]
[null,"File path:","C:\\users\\USERNAME\\desktop\\",null,null,null,null,null,null,null,0.9,2,1041.5,"custom 3",null,null,"@","jump+10",null,"Import"]
[null,null,null,null,null,null,null,null,null,null,null,"","",null,null,null,"#","jump+20",null,null,null,null,false]
[null,"To export waypoints, (1) enter file name and file path above,",null,null,null,null,null,null,null,null,null,"","",null,null,null,null,null,null,"C:\\users\\USERNAME\\desktop\\BPExportE1.gpx"]
[null,"(2) select all green columns and desired rows, (3) click Export GPX",null,null,null,null,null,null,null,null,null,{"$f":"SUM(L4:L12)","v":20}]
[null,"Option: For extended content, extend selection to include Leg, or Leg and Suffix columns.",null,null,null,null,null,null,"Route A Points",null,null,null,"Map Symbols",null,null,null,null,"Locations",null,null,"Combinations"]
[]
[null,"Lat","Long","Name","Comment","Desc","Symbol",null,"Name",{"$f":"COUNTA(J17:J766)","v":0},{"$f":"SUM(K17:K766)","v":0},null,"Points","Map Symbol",null,null,null,"Leg","Name","Points","Suffix","Comment","Lat","Long","Map"]
[1,{"$f":"IF(W17=\"\",\"\",GETLat(W17))","v":46.266021000000002},{"$f":"IF(X17=\"\",\"\",GETLONG(X17))","v":-96.587089000000006},{"$f":"NamePlus($O$7, S17, T17, U17, V17)","v":"1.1112."},{"$f":"IF(V17=\"\",\"\",V17)","v":"Breckenridge, MN"},{"$f":"IF(T17=\"\",\"\",IF($F$9 = TRUE,T17,\"\"))","v":1112},{"$f":"N17","v":"custom 3"},null,{"$f":"IF(S17=\"\",\"\",S17)","v":1},null,{"$f":"IF(J17<>\"\",T17,\"\")","v":""},null,{"$f":"IF(T17=\"\",\"\",T17)","v":1112},{"$f":"IF(U17=\"\", O17, MAPSYMBOL(O17, U17, $O$8))","v":"custom 3"},{"$f":"IF(OR(W17=\"\",X17=\"\"),\"\",VLOOKUP(T17,$M$4:$N$12,2,TRUE))","v":"custom 3"},null,null,null,1,1112,null,"Breckenridge, MN","46.266021, -96.587089","46.266021, -96.587089",{"$f":"IF(OR(W17=\"\",X17=\"\"),\"\",HYPERLINK(\"https://maps.google.com/maps?q=\"&B17&\",\"&C17))","v":"https://maps.google.com/maps?q=46.266021,-96.587089"}]
[2,{"$f":"IF(W18=\"\",\"\",GETLat(W18))","v":45.977049999999998},{"$f":"IF(X18=\"\",\"\",GETLONG(X18))","v":-96.735583333333338},"4.1020.","Lamars, ND",1020,"custom 1",null,4,null,"",null,1020,{"$f":"IF(U18=\"\", O18, MAPSYMBOL(O18, U18, $O$8))","v":"custom 1"},"custom 1",null,null,null,4,1020,null,"Lamars, ND","45 58.623 N","96 44.135 W",{"$f":"IF(OR(W18=\"\",X18=\"\"),\"\",HYPERLINK(\"https://maps.google.com/maps?q=\"&B18&\",\"&C18))","v":"https://maps.google.com/maps?q=45.97705,-96.7355833333333"}]
[3,{"$f":"IF(W19=\"\",\"\",GETLat(W19))","v":46.735833333333332},{"$f":"IF(X19=\"\",\"\",GETLONG(X19))","v":-94.135424999999998},"7.925.","Manhattan Beach, MN",925,"custom 1",null,7,null,"",null,925,{"$f":"IF(U19=\"\", O19, MAPSYMBOL(O19, U19, $O$8))","v":"custom 1"},"custom 1",null,null,null,7,925,null,"Manhattan Beach, MN","46 44.150","-94 08.1255","https://maps.google.com/maps?q=46.7358333333333,-94.135425"]
[4,{"$f":"IF(W20=\"\",\"\",GETLat(W20))","v":44.448323000000002},{"$f":"IF(X20=\"\",\"\",GETLONG(X20))","v":-94.726881000000006},"8.987.","72158 County Rd. 30, Fairfax, MN",987,"custom 1",null,8,null,"",null,987,{"$f":"IF(U20=\"\", O20, MAPSYMBOL(O20, U20, $O$8))","v":"custom 1"},"custom 1",null,null,null,8,987,null,"72158 County Rd. 30, Fairfax, MN","44.448323","-94.726881","https://maps.google.com/maps?q=44.448323,-94.726881"]
[5,{"$f":"IF(W21=\"\",\"\",GETLat(W21))","v":46.3801804},{"$f":"IF(X21=\"\",\"\",GETLONG(X21))","v":-94.951972999999995},"09.680. C1","Aldrich, MN",680,"circle, blue",null,"09",null,"",null,680,{"$f":"IF(U21=\"\", O21, MAPSYMBOL(O21, U21, $O$8))","v":"circle, blue"},"circle, blue",null,null,null,"09",680," C1","Aldrich, MN","46.3801804","-94.951973","https://maps.google.com/maps?q=46.3801804,-94.951973"]
[6,{"$f":"IF(W22=\"\",\"\",GETLat(W22))","v":46.260444999999997},{"$f":"IF(X22=\"\",\"\",GETLONG(X22))","v":-94.319569999999999},"11.1000.C1","7393 State HWY 371, Brainard, MN",1000,"custom 1",null,"11",null,"",null,1000,{"$f":"IF(U22=\"\", O22, MAPSYMBOL(O22, U22, $O$8))","v":"custom 1"},"custom 1",null,null,null,"11",1000,"C1","7393 State HWY 371, Brainard, MN","46.260445","-94.319570","https://maps.google.com/maps?q=46.260445,-94.31957"]
[7,{"$f":"IF(W23=\"\",\"\",GETLat(W23))","v":46.875911700000003},{"$f":"IF(X23=\"\",\"\",GETLONG(X23))","v":-92.945022600000001},"12.1035.#-10a-2p C1","Halden Township, MN",1035,"Custom 22",null,"12",null,"",null,1035,{"$f":"IF(U23=\"\", O23, MAPSYMBOL(O23, U23, $O$8))","v":"Custom 22"},"custom 2",null,null,null,"12",1035,"#-10a-2p C1","Halden Township, MN","46.8759117","-92.9450226","https://maps.google.com/maps?q=46.8759117,-92.9450226"]
[8,{"$f":"IF(W24=\"\",\"\",GETLat(W24))","v":45.418030999999999},{"$f":"IF(X24=\"\",\"\",GETLONG(X24))","v":-94.048882000000006},"15.825.C1 ","Clearwater, MN",825,"circle, red",null,"15",null,"",null,825,{"$f":"IF(U24=\"\", O24, MAPSYMBOL(O24, U24, $O$8))","v":"circle, red"},"circle, red",null,null,null,"15",825,"C1 ","Clearwater, MN","45.418031, -94.048882","45.418031, -94.048882","https://maps.google.com/maps?q=45.418031,-94.048882"]
[9,{"$f":"IF(W25=\"\",\"\",GETLat(W25))","v":45.610900899999997},{"$f":"IF(X25=\"\",\"\",GETLONG(X25))","v":-94.370796200000001},"AVO.580. T 0900-1700","Avon, MN",580,"triangle, blue",null,"AVO",null,"",null,580,{"$f":"IF(U25=\"\", O25, MAPSYMBOL(O25, U25, $O$8))","v":"triangle, blue"},"circle, blue",null,null,null,"AVO",580," T 0900-1700","Avon, MN","45.6109009","-94.3707962","https://maps.google.com/maps?q=45.6109009,-94.3707962"]
[10,{"$f":"IF(W26=\"\",\"\",GETLat(W26))","v":44.630277777777778},{"$f":"IF(X26=\"\",\"\",GETLONG(X26))","v":-93.768888888888895},"BEL.0.end","Belle Plain, MN",0,"anchor",null,"BEL",null,"",null,0,{"$f":"IF(U26=\"\", O26, MAPSYMBOL(O26, U26, $O$8))","v":"anchor"},"anchor",null,null,null,"BEL",0,"end","Belle Plain, MN","44°37'49.0\"N","93°46'08.0\"W","https://maps.google.com/maps?q=44.6302777777778,-93.7688888888889"]
[11,{"$f":"IF(W27=\"\",\"\",GETLat(W27))","v":45.451002000000003},{"$f":"IF(X27=\"\",\"\",GETLONG(X27))","v":-95.001223999999993},"BLG.750.rest","Belgrade, MN",750,"circle, red",null,"BLG",null,"",null,750,{"$f":"IF(U27=\"\", O27, MAPSYMBOL(O27, U27, $O$8))","v":"circle, red"},"circle, red",null,null,null,"BLG",750,"rest","Belgrade, MN","45.451002","-95.001224","https://maps.google.com/maps?q=45.451002,-95.001224"]
[12,{"$f":"IF(W28=\"\",\"\",GETLat(W28))","v":""},{"$f":"IF(X28=\"\",\"\",GETLONG(X28))","v":""},"Comb1.720. C1","15,12,09,11",720,"",null,"Comb1",null,"",null,720,{"$f":"IF(U28=\"\", O28, MAPSYMBOL(O28, U28, $O$8))","v":""},"",null,null,null,"Comb1",720," C1","15,12,09,11",null,null,""]
[13,{"$f":"IF(W29=\"\",\"\",GETLat(W29))","v":44.528999300000002},{"$f":"IF(X29=\"\",\"\",GETLONG(X29))","v":-96.810668899999996},"FAI.1030.@daylight","Bruce, SD",1030,"Custom 12",null,"FAI",null,"",null,1030,{"$f":"IF(U29=\"\", O29, MAPSYMBOL(O29, U29, $O$8))","v":"Custom 12"},"custom 2",null,null,null,"FAI",1030,"@daylight","Bruce, SD","44.5289993","-96.8106689","https://maps.google.com/maps?q=44.5289993,-96.8106689"]
[14,{"$f":"IF(W30=\"\",\"\",GETLat(W30))","v":45.171135},{"$f":"IF(X30=\"\",\"\",GETLONG(X30))","v":-91.685422000000003},"FRE.555.","Sand Creek, WI",555,"circle, green",null,"FRE",null,"",null,555,{"$f":"IF(U30=\"\", O30, MAPSYMBOL(O30, U30, $O$8))","v":"circle, green"},"circle, green",null,null,null,"FRE",555,null,"Sand Creek, WI","45.171135","-91.685422","https://maps.google.com/maps?q=45.171135,-91.685422"]
[15,{"$f":"IF(W31=\"\",\"\",GETLat(W31))","v":45.151333333333334},{"$f":"IF(X31=\"\",\"\",GETLONG(X31))","v":-94.680805555555551},"GRO.1100.@daylight","Grove City, MN",1100,"Custom 13",null,"GRO",null,"",null,1100,{"$f":"IF(U31=\"\", O31, MAPSYMBOL(O31, U31, $O$8))","v":"Custom 13"},"custom 3",null,null,null,"GRO",1100,"@daylight","Grove City, MN","45 09 04.8N","94 40 50.9W","https://maps.google.com/maps?q=45.1513333333333,-94.6808055555556"]
[16,{"$f":"IF(W32=\"\",\"\",GETLat(W32))","v":46.776240999999999},{"$f":"IF(X32=\"\",\"\",GETLONG(X32))","v":-97.503653999999997},"H9BNM.800.T -Sa 12p-6p","Wild Card  Arch",800,"triangle, red",null,"H9BNM",null,"",null,800,{"$f":"IF(U32=\"\", O32, MAPSYMBOL(O32, U32, $O$8))","v":"triangle, red"},"circle, red",null,null,null,"H9BNM",800,"T -Sa 12p-6p","Wild Card  Arch","46.776241","-97.503654","https://maps.google.com/maps?q=46.776241,-97.503654"]
[17,{"$f":"IF(W33=\"\",\"\",GETLat(W33))","v":45.347801199999999},{"$f":"IF(X33=\"\",\"\",GETLONG(X33))","v":-94.696701000000004},"HAW.650.S daylight","Paynesville, MN",650,"square, blue",null,"HAW",null,"",null,650,{"$f":"IF(U33=\"\", O33, MAPSYMBOL(O33, U33, $O$8))","v":"square, blue"},"circle, blue",null,null,null,"HAW",650,"S daylight","Paynesville, MN","45.3478012","-94.696701","https://maps.google.com/maps?q=45.3478012,-94.696701"]
[18,{"$f":"IF(W34=\"\",\"\",GETLat(W34))","v":44.527950300000001},{"$f":"IF(X34=\"\",\"\",GETLONG(X34))","v":-95.379051200000006},"HEN.0.begin","Vesta Township, MN",0,"anchor",null,"HEN",null,"",null,0,{"$f":"IF(U34=\"\", O34, MAPSYMBOL(O34, U34, $O$8))","v":"anchor"},"anchor",null,null,null,"HEN",0,"begin","Vesta Township, MN","44.5279503","-95.3790512","https://maps.google.com/maps?q=44.5279503,-95.3790512"]
[19,{"$f":"IF(W35=\"\",\"\",GETLat(W35))","v":45.312011699999999},{"$f":"IF(X35=\"\",\"\",GETLONG(X35))","v":-94.322119999999998},"KIM.500.","Kimball, MN",500,"circle, green",null,"KIM",null,"",null,500,{"$f":"IF(U35=\"\", O35, MAPSYMBOL(O35, U35, $O$8))","v":"circle, green"},"circle, green",null,null,null,"KIM",500,null,"Kimball, MN","45.3120117","-94.32212","https://maps.google.com/maps?q=45.3120117,-94.32212"]
[20,{"$f":"IF(W36=\"\",\"\",GETLat(W36))","v":45.976300999999999},{"$f":"IF(X36=\"\",\"\",GETLONG(X36))","v":-94.367040000000003},"LIT.610.","Little Falls, MN",610,"circle, blue",null,"LIT",null,"",null,610,{"$f":"IF(U36=\"\", O36, MAPSYMBOL(O36, U36, $O$8))","v":"circle, blue"},"circle, blue",null,null,null,"LIT",610,null,"Little Falls, MN","45.976301, -94.367040","45.976301, -94.367040","https://maps.google.com/maps?q=45.976301,-94.36704"]
[21,{"$f":"IF(W37=\"\",\"\",GETLat(W37))","v":""},{"$f":"IF(X37=\"\",\"\",GETLONG(X37))","v":""},"","","","",null,"",null,"",null,"",{"$f":"IF(U37=\"\", O37, MAPSYMBOL(O37, U37, $O$8))","v":""},"",null,null,null,null,null,null,null,null,null,""]
[22,{"$f":"IF(W38=\"\",\"\",GETLat(W38))","v":""},{"$f":"IF(X38=\"\",\"\",GETLONG(X38))","v":""},"","","","",null,"",null,"",null,"",{"$f":"IF(U38=\"\", O38, MAPSYMBOL(O38, U38, $O$8))","v":""},"",null,null,null,null,null,null,null,null,null,""]
[23,{"$f":"IF(W39=\"\",\"\",GETLat(W39))","v":""},{"$f":"IF(X39=\"\",\"\",GETLONG(X39))","v":""},"","","","",null,"",null,"",null,"",{"$f":"IF(U39=\"\", O39, MAPSYMBOL(O39, U39, $O$8))","v":""},"",null,null,null,null,null,null,null,null,null,""]
[24,{"$f":"IF(W40=\"\",\"\",GETLat(W40))","v":""},{"$f":"IF(X40=\"\",\"\",GETLONG(X40))","v":""},"","","","",null,"",null,"",null,"",{"$f":"IF(U40=\"\", O40, MAPSYMBOL(O40, U40, $O$8))","v":""},"",null,null,null,null,null,null,null,null,null,""]
[25,{"$f":"IF(W41=\"\",\"\",GETLat(W41))","v":""},{"$f":"IF(X41=\"\",\"\",GETLONG(X41))","v":""},"","","","",null,"",null,"",null,"",{"$f":"IF(U41=\"\", O41, MAPSYMBOL(O41, U41, $O$8))","v":""},"",null,null,null,null,null,null,null,null,null,""]
[26,{"$f":"IF(W42=\"\",\"\",GETLat(W42))","v":""},{"$f":"IF(X42=\"\",\"\",GETLONG(X42))","v":""},"","","","",null,"",null,"",null,"",{"$f":"IF(U42=\"\", O42, MAPSYMBOL(O42, U42, $O$8))","v":""},"",null,null,null,null,null,null,null,null,null,""]
[27,{"$f":"IF(W43=\"\",\"\",GETLat(W43))","v":""},{"$f":"IF(X43=\"\",\"\",GETLONG(X43))","v":""},"","","","",null,"",null,"",null,"",{"$f":"IF(U43=\"\", O43, MAPSYMBOL(O43, U43, $O$8))","v":""},"",null,null,null,null,null,null,null,null,null,""]
[28,{"$f":"IF(W44=\"\",\"\",GETLat(W44))","v":""},{"$f":"IF(X44=\"\",\"\",GETLONG(X44))","v":""},"","","","",null,"",null,"",null,"",{"$f":"IF(U44=\"\", O44, MAPSYMBOL(O44, U44, $O$8))","v":""},"",null,null,null,null,null,null,null,null,null,""]
[29,{"$f":"IF(W45=\"\",\"\",GETLat(W45))","v":""},{"$f":"IF(X45=\"\",\"\",GETLONG(X45))","v":""},"","","","",null,"",null,"",null,"",{"$f":"IF(U45=\"\", O45, MAPSYMBOL(O45, U45, $O$8))","v":""},"",null,null,null,null,null,null,null,null,null,""]
[30,{"$f":"IF(W46=\"\",\"\",GETLat(W46))","v":""},{"$f":"IF(X46=\"\",\"\",GETLONG(X46))","v":""},"","","","",null,"",null,"",null,"",{"$f":"IF(U46=\"\", O46, MAPSYMBOL(O46, U46, $O$8))","v":""},"",null,null,null,null,null,null,null,null,null,""]
[31,{"$f":"IF(W47=\"\",\"\",GETLat(W47))","v":""},{"$f":"IF(X47=\"\",\"\",GETLONG(X47))","v":""},"","","","",null,"",null,"",null,"",{"$f":"IF(U47=\"\", O47, MAPSYMBOL(O47, U47, $O$8))","v":""},"",null,null,null,null,null,null,null,null,null,""]
[32,{"$f":"IF(W48=\"\",\"\",GETLat(W48))","v":""},{"$f":"IF(X48=\"\",\"\",GETLONG(X48))","v":""},"","","","",null,"",null,"",null,"",{"$f":"IF(U48=\"\", O48, MAPSYMBOL(O48, U48, $O$8))","v":""},"",null,null,null,null,null,null,null,null,null,""]
[33,{"$f":"IF(W49=\"\",\"\",GETLat(W49))","v":""},{"$f":"IF(X49=\"\",\"\",GETLONG(X49))","v":""},"","","","",null,"",null,"",null,"",{"$f":"IF(U49=\"\", O49, MAPSYMBOL(O49, U49, $O$8))","v":""},"",null,null,null,null,null,null,null,null,null,""]
[34,{"$f":"IF(W50=\"\",\"\",GETLat(W50))","v":""},{"$f":"IF(X50=\"\",\"\",GETLONG(X50))","v":""},"","","","",null,"",null,"",null,"",{"$f":"IF(U50=\"\", O50, MAPSYMBOL(O50, U50, $O$8))","v":""},"",null,null,null,null,null,null,null,null,null,""]
[35,{"$f":"IF(W51=\"\",\"\",GETLat(W51))","v":""},{"$f":"IF(X51=\"\",\"\",GETLONG(X51))","v":""},"","","","",null,"",null,"",null,"",{"$f":"IF(U51=\"\", O51, MAPSYMBOL(O51, U51, $O$8))","v":""},"",null,null,null,null,null,null,null,null,null,""]
[36,{"$f":"IF(W52=\"\",\"\",GETLat(W52))","v":""},{"$f":"IF(X52=\"\",\"\",GETLONG(X52))","v":""},"","","","",null,"",null,"",null,"",{"$f":"IF(U52=\"\", O52, MAPSYMBOL(O52, U52, $O$8))","v":""},"",null,null,null,null,null,null,null,null,null,""]
[37,{"$f":"IF(W53=\"\",\"\",GETLat(W53))","v":""},{"$f":"IF(X53=\"\",\"\",GETLONG(X53))","v":""},"","","","",null,"",null,"",null,"",{"$f":"IF(U53=\"\", O53, MAPSYMBOL(O53, U53, $O$8))","v":""},"",null,null,null,null,null,null,null,null,null,""]
[38,{"$f":"IF(W54=\"\",\"\",GETLat(W54))","v":""},{"$f":"IF(X54=\"\",\"\",GETLONG(X54))","v":""},"","","","",null,"",null,"",null,"",{"$f":"IF(U54=\"\", O54, MAPSYMBOL(O54, U54, $O$8))","v":""},"",null,null,null,null,null,null,null,null,null,""]
[39,{"$f":"IF(W55=\"\",\"\",GETLat(W55))","v":""},{"$f":"IF(X55=\"\",\"\",GETLONG(X55))","v":""},"","","","",null,"",null,"",null,"",{"$f":"IF(U55=\"\", O55, MAPSYMBOL(O55, U55, $O$8))","v":""},"",null,null,null,null,null,null,null,null,null,""]
[40,{"$f":"IF(W56=\"\",\"\",GETLat(W56))","v":""},{"$f":"IF(X56=\"\",\"\",GETLONG(X56))","v":""},"","","","",null,"",null,"",null,"",{"$f":"IF(U56=\"\", O56, MAPSYMBOL(O56, U56, $O$8))","v":""},"",null,null,null,null,null,null,null,null,null,""]
[41,{"$f":"IF(W57=\"\",\"\",GETLat(W57))","v":""},{"$f":"IF(X57=\"\",\"\",GETLONG(X57))","v":""},"","","","",null,"",null,"",null,"",{"$f":"IF(U57=\"\", O57, MAPSYMBOL(O57, U57, $O$8))","v":""},"",null,null,null,null,null,null,null,null,null,""]
[42,{"$f":"IF(W58=\"\",\"\",GETLat(W58))","v":""},{"$f":"IF(X58=\"\",\"\",GETLONG(X58))","v":""},"","","","",null,"",null,"",null,"",{"$f":"IF(U58=\"\", O58, MAPSYMBOL(O58, U58, $O$8))","v":""},"",null,null,null,null,null,null,null,null,null,""]
[43,{"$f":"IF(W59=\"\",\"\",GETLat(W59))","v":""},{"$f":"IF(X59=\"\",\"\",GETLONG(X59))","v":""},"","","","",null,"",null,"",null,"",{"$f":"IF(U59=\"\", O59, MAPSYMBOL(O59, U59, $O$8))","v":""},"",null,null,null,null,null,null,null,null,null,""]
[44,{"$f":"IF(W60=\"\",\"\",GETLat(W60))","v":""},{"$f":"IF(X60=\"\",\"\",GETLONG(X60))","v":""},"","","","",null,"",null,"",null,"",{"$f":"IF(U60=\"\", O60, MAPSYMBOL(O60, U60, $O$8))","v":""},"",null,null,null,null,null,null,null,null,null,""]
[45,{"$f":"IF(W61=\"\",\"\",GETLat(W61))","v":""},{"$f":"IF(X61=\"\",\"\",GETLONG(X61))","v":""},"","","","",null,"",null,"",null,"",{"$f":"IF(U61=\"\", O61, MAPSYMBOL(O61, U61, $O$8))","v":""},"",null,null,null,null,null,null,null,null,null,""]
[46,{"$f":"IF(W62=\"\",\"\",GETLat(W62))","v":""},{"$f":"IF(X62=\"\",\"\",GETLONG(X62))","v":""},"","","","",null,"",null,"",null,"",{"$f":"IF(U62=\"\", O62, MAPSYMBOL(O62, U62, $O$8))","v":""},"",null,null,null,null,null,null,null,null,null,""]
[47,{"$f":"IF(W63=\"\",\"\",GETLat(W63))","v":""},{"$f":"IF(X63=\"\",\"\",GETLONG(X63))","v":""},"","","","",null,"",null,"",null,"",{"$f":"IF(U63=\"\", O63, MAPSYMBOL(O63, U63, $O$8))","v":""},"",null,null,null,null,null,null,null,null,null,""]
[48,{"$f":"IF(W64=\"\",\"\",GETLat(W64))","v":""},{"$f":"IF(X64=\"\",\"\",GETLONG(X64))","v":""},"","","","",null,"",null,"",null,"",{"$f":"IF(U64=\"\", O64, MAPSYMBOL(O64, U64, $O$8))","v":""},"",null,null,null,null,null,null,null,null,null,""]
[49,{"$f":"IF(W65=\"\",\"\",GETLat(W65))","v":""},{"$f":"IF(X65=\"\",\"\",GETLONG(X65))","v":""},"","","","",null,"",null,"",null,"",{"$f":"IF(U65=\"\", O65, MAPSYMBOL(O65, U65, $O$8))","v":""},"",null,null,null,null,null,null,null,null,null,""]
[50,{"$f":"IF(W66=\"\",\"\",GETLat(W66))","v":""},{"$f":"IF(X66=\"\",\"\",GETLONG(X66))","v":""},"","","","",null,"",null,"",null,"",{"$f":"IF(U66=\"\", O66, MAPSYMBOL(O66, U66, $O$8))","v":""},"",null,null,null,null,null,null,null,null,null,""]
[51,{"$f":"IF(W67=\"\",\"\",GETLat(W67))","v":""},{"$f":"IF(X67=\"\",\"\",GETLONG(X67))","v":""},"","","","",null,"",null,"",null,"",{"$f":"IF(U67=\"\", O67, MAPSYMBOL(O67, U67, $O$8))","v":""},"",null,null,null,null,null,null,null,null,null,""]
[52,{"$f":"IF(W68=\"\",\"\",GETLat(W68))","v":""},{"$f":"IF(X68=\"\",\"\",GETLONG(X68))","v":""},"","","","",null,"",null,"",null,"",{"$f":"IF(U68=\"\", O68, MAPSYMBOL(O68, U68, $O$8))","v":""},"",null,null,null,null,null,null,null,null,null,""]
[53,{"$f":"IF(W69=\"\",\"\",GETLat(W69))","v":""},{"$f":"IF(X69=\"\",\"\",GETLONG(X69))","v":""},"","","","",null,"",null,"",null,"",{"$f":"IF(U69=\"\", O69, MAPSYMBOL(O69, U69, $O$8))","v":""},"",null,null,null,null,null,null,null,null,null,""]
[54,{"$f":"IF(W70=\"\",\"\",GETLat(W70))","v":""},{"$f":"IF(X70=\"\",\"\",GETLONG(X70))","v":""},"","","","",null,"",null,"",null,"",{"$f":"IF(U70=\"\", O70, MAPSYMBOL(O70, U70, $O$8))","v":""},"",null,null,null,null,null,null,null,null,null,""]
[55,{"$f":"IF(W71=\"\",\"\",GETLat(W71))","v":""},{"$f":"IF(X71=\"\",\"\",GETLONG(X71))","v":""},"","","","",null,"",null,"",null,"",{"$f":"IF(U71=\"\", O71, MAPSYMBOL(O71, U71, $O$8))","v":""},"",null,null,null,null,null,null,null,null,null,""]
[56,{"$f":"IF(W72=\"\",\"\",GETLat(W72))","v":""},{"$f":"IF(X72=\"\",\"\",GETLONG(X72))","v":""},"","","","",null,"",null,"",null,"",{"$f":"IF(U72=\"\", O72, MAPSYMBOL(O72, U72, $O$8))","v":""},"",null,null,null,null,null,null,null,null,null,""]
[57,{"$f":"IF(W73=\"\",\"\",GETLat(W73))","v":""},{"$f":"IF(X73=\"\",\"\",GETLONG(X73))","v":""},"","","","",null,"",null,"",null,"",{"$f":"IF(U73=\"\", O73, MAPSYMBOL(O73, U73, $O$8))","v":""},"",null,null,null,null,null,null,null,null,null,""]
[58,{"$f":"IF(W74=\"\",\"\",GETLat(W74))","v":""},{"$f":"IF(X74=\"\",\"\",GETLONG(X74))","v":""},"","","","",null,"",null,"",null,"",{"$f":"IF(U74=\"\", O74, MAPSYMBOL(O74, U74, $O$8))","v":""},"",null,null,null,null,null,null,null,null,null,""]
[59,{"$f":"IF(W75=\"\",\"\",GETLat(W75))","v":""},{"$f":"IF(X75=\"\",\"\",GETLONG(X75))","v":""},"","","","",null,"",null,"",null,"",{"$f":"IF(U75=\"\", O75, MAPSYMBOL(O75, U75, $O$8))","v":""},"",null,null,null,null,null,null,null,null,null,""]
[60,{"$f":"IF(W76=\"\",\"\",GETLat(W76))","v":""},{"$f":"IF(X76=\"\",\"\",GETLONG(X76))","v":""},"","","","",null,"",null,"",null,"",{"$f":"IF(U76=\"\", O76, MAPSYMBOL(O76, U76, $O$8))","v":""},"",null,null,null,null,null,null,null,null,null,""]
[61,{"$f":"IF(W77=\"\",\"\",GETLat(W77))","v":""},{"$f":"IF(X77=\"\",\"\",GETLONG(X77))","v":""},"","","","",null,"",null,"",null,"",{"$f":"IF(U77=\"\", O77, MAPSYMBOL(O77, U77, $O$8))","v":""},"",null,null,null,null,null,null,null,null,null,""]
[62,{"$f":"IF(W78=\"\",\"\",GETLat(W78))","v":""},{"$f":"IF(X78=\"\",\"\",GETLONG(X78))","v":""},"","","","",null,"",null,"",null,"",{"$f":"IF(U78=\"\", O78, MAPSYMBOL(O78, U78, $O$8))","v":""},"",null,null,null,null,null,null,null,null,null,""]
[63,{"$f":"IF(W79=\"\",\"\",GETLat(W79))","v":""},{"$f":"IF(X79=\"\",\"\",GETLONG(X79))","v":""},"","","","",null,"",null,"",null,"",{"$f":"IF(U79=\"\", O79, MAPSYMBOL(O79, U79, $O$8))","v":""},"",null,null,null,null,null,null,null,null,null,""]
[64,{"$f":"IF(W80=\"\",\"\",GETLat(W80))","v":""},{"$f":"IF(X80=\"\",\"\",GETLONG(X80))","v":""},"","","","",null,"",null,"",null,"",{"$f":"IF(U80=\"\", O80, MAPSYMBOL(O80, U80, $O$8))","v":""},"",null,null,null,null,null,null,null,null,null,""]
[65,{"$f":"IF(W81=\"\",\"\",GETLat(W81))","v":""},{"$f":"IF(X81=\"\",\"\",GETLONG(X81))","v":""},{"$f":"NamePlus($O$7, S81, T81, U81, V81)","v":""},{"$f":"IF(V81=\"\",\"\",V81)","v":""},{"$f":"IF(T81=\"\",\"\",IF($F$9 = TRUE,T81,\"\"))","v":""},{"$f":"N81","v":""},null,{"$f":"IF(S81=\"\",\"\",S81)","v":""},null,{"$f":"IF(J81<>\"\",T81,\"\")","v":""},null,{"$f":"IF(T81=\"\",\"\",T81)","v":""},{"$f":"IF(U81=\"\", O81, MAPSYMBOL(O81, U81, $O$8))","v":""},{"$f":"IF(OR(W81=\"\",X81=\"\"),\"\",VLOOKUP(T81,$M$4:$N$12,2,TRUE))","v":""},null,null,null,null,null,null,null,null,null,""]
[66,{"$f":"IF(W82=\"\",\"\",GETLat(W82))","v":""},{"$f":"IF(X82=\"\",\"\",GETLONG(X82))","v":""},"","","","",null,"",null,"",null,"",{"$f":"IF(U82=\"\", O82, MAPSYMBOL(O82, U82, $O$8))","v":""},"",null,null,null,null,null,null,null,null,null,{"$f":"IF(OR(W82=\"\",X82=\"\"),\"\",HYPERLINK(\"https://maps.google.com/maps?q=\"&B82&\",\"&C82))","v":""}]
[67,{"$f":"IF(W83=\"\",\"\",GETLat(W83))","v":""},{"$f":"IF(X83=\"\",\"\",GETLONG(X83))","v":""},"","","","",null,"",null,"",null,"",{"$f":"IF(U83=\"\", O83, MAPSYMBOL(O83, U83, $O$8))","v":""},"",null,null,null,null,null,null,null,null,null,""]
[68,{"$f":"IF(W84=\"\",\"\",GETLat(W84))","v":""},{"$f":"IF(X84=\"\",\"\",GETLONG(X84))","v":""},"","","","",null,"",null,"",null,"",{"$f":"IF(U84=\"\", O84, MAPSYMBOL(O84, U84, $O$8))","v":""},"",null,null,null,null,null,null,null,null,null,""]
[69,{"$f":"IF(W85=\"\",\"\",GETLat(W85))","v":""},{"$f":"IF(X85=\"\",\"\",GETLONG(X85))","v":""},"","","","",null,"",null,"",null,"",{"$f":"IF(U85=\"\", O85, MAPSYMBOL(O85, U85, $O$8))","v":""},"",null,null,null,null,null,null,null,null,null,""]
[70,{"$f":"IF(W86=\"\",\"\",GETLat(W86))","v":""},{"$f":"IF(X86=\"\",\"\",GETLONG(X86))","v":""},"","","","",null,"",null,"",null,"",{"$f":"IF(U86=\"\", O86, MAPSYMBOL(O86, U86, $O$8))","v":""},"",null,null,null,null,null,null,null,null,null,""]
[71,{"$f":"IF(W87=\"\",\"\",GETLat(W87))","v":""},{"$f":"IF(X87=\"\",\"\",GETLONG(X87))","v":""},"","","","",null,"",null,"",null,"",{"$f":"IF(U87=\"\", O87, MAPSYMBOL(O87, U87, $O$8))","v":""},"",null,null,null,null,null,null,null,null,null,""]
[72,{"$f":"IF(W88=\"\",\"\",GETLat(W88))","v":""},{"$f":"IF(X88=\"\",\"\",GETLONG(X88))","v":""},"","","","",null,"",null,"",null,"",{"$f":"IF(U88=\"\", O88, MAPSYMBOL(O88, U88, $O$8))","v":""},"",null,null,null,null,null,null,null,null,null,""]
[73,{"$f":"IF(W89=\"\",\"\",GETLat(W89))","v":""},{"$f":"IF(X89=\"\",\"\",GETLONG(X89))","v":""},"","","","",null,"",null,"",null,"",{"$f":"IF(U89=\"\", O89, MAPSYMBOL(O89, U89, $O$8))","v":""},"",null,null,null,null,null,null,null,null,null,""]
[74,{"$f":"IF(W90=\"\",\"\",GETLat(W90))","v":""},{"$f":"IF(X90=\"\",\"\",GETLONG(X90))","v":""},"","","","",null,"",null,"",null,"",{"$f":"IF(U90=\"\", O90, MAPSYMBOL(O90, U90, $O$8))","v":""},"",null,null,null,null,null,null,null,null,null,""]
[75,{"$f":"IF(W91=\"\",\"\",GETLat(W91))","v":""},{"$f":"IF(X91=\"\",\"\",GETLONG(X91))","v":""},"","","","",null,"",null,"",null,"",{"$f":"IF(U91=\"\", O91, MAPSYMBOL(O91, U91, $O$8))","v":""},"",null,null,null,null,null,null,null,null,null,""]
[76,{"$f":"IF(W92=\"\",\"\",GETLat(W92))","v":""},{"$f":"IF(X92=\"\",\"\",GETLONG(X92))","v":""},"","","","",null,"",null,"",null,"",{"$f":"IF(U92=\"\", O92, MAPSYMBOL(O92, U92, $O$8))","v":""},"",null,null,null,null,null,null,null,null,null,""]
[77,{"$f":"IF(W93=\"\",\"\",GETLat(W93))","v":""},{"$f":"IF(X93=\"\",\"\",GETLONG(X93))","v":""},"","","","",null,"",null,"",null,"",{"$f":"IF(U93=\"\", O93, MAPSYMBOL(O93, U93, $O$8))","v":""},"",null,null,null,null,null,null,null,null,null,""]
[78,{"$f":"IF(W94=\"\",\"\",GETLat(W94))","v":""},{"$f":"IF(X94=\"\",\"\",GETLONG(X94))","v":""},"","","","",null,"",null,"",null,"",{"$f":"IF(U94=\"\", O94, MAPSYMBOL(O94, U94, $O$8))","v":""},"",null,null,null,null,null,null,null,null,null,""]
[79,{"$f":"IF(W95=\"\",\"\",GETLat(W95))","v":""},{"$f":"IF(X95=\"\",\"\",GETLONG(X95))","v":""},"","","","",null,"",null,"",null,"",{"$f":"IF(U95=\"\", O95, MAPSYMBOL(O95, U95, $O$8))","v":""},"",null,null,null,null,null,null,null,null,null,""]
[80,{"$f":"IF(W96=\"\",\"\",GETLat(W96))","v":""},{"$f":"IF(X96=\"\",\"\",GETLONG(X96))","v":""},"","","","",null,"",null,"",null,"",{"$f":"IF(U96=\"\", O96, MAPSYMBOL(O96, U96, $O$8))","v":""},"",null,null,null,null,null,null,null,null,null,""]
[81,{"$f":"IF(W97=\"\",\"\",GETLat(W97))","v":""},{"$f":"IF(X97=\"\",\"\",GETLONG(X97))","v":""},"","","","",null,"",null,"",null,"",{"$f":"IF(U97=\"\", O97, MAPSYMBOL(O97, U97, $O$8))","v":""},"",null,null,null,null,null,null,null,null,null,""]
[82,{"$f":"IF(W98=\"\",\"\",GETLat(W98))","v":""},{"$f":"IF(X98=\"\",\"\",GETLONG(X98))","v":""},"","","","",null,"",null,"",null,"",{"$f":"IF(U98=\"\", O98, MAPSYMBOL(O98, U98, $O$8))","v":""},"",null,null,null,null,null,null,null,null,null,""]
[83,{"$f":"IF(W99=\"\",\"\",GETLat(W99))","v":""},{"$f":"IF(X99=\"\",\"\",GETLONG(X99))","v":""},"","","","",null,"",null,"",null,"",{"$f":"IF(U99=\"\", O99, MAPSYMBOL(O99, U99, $O$8))","v":""},"",null,null,null,null,null,null,null,null,null,""]
[84,{"$f":"IF(W100=\"\",\"\",GETLat(W100))","v":""},{"$f":"IF(X100=\"\",\"\",GETLONG(X100))","v":""},"","","","",null,"",null,"",null,"",{"$f":"IF(U100=\"\", O100, MAPSYMBOL(O100, U100, $O$8))","v":""},"",null,null,null,null,null,null,null,null,null,""]
[85,{"$f":"IF(W101=\"\",\"\",GETLat(W101))","v":""},{"$f":"IF(X101=\"\",\"\",GETLONG(X101))","v":""},"","","","",null,"",null,"",null,"",{"$f":"IF(U101=\"\", O101, MAPSYMBOL(O101, U101, $O$8))","v":""},"",null,null,null,null,null,null,null,null,null,""]
[86,{"$f":"IF(W102=\"\",\"\",GETLat(W102))","v":""},{"$f":"IF(X102=\"\",\"\",GETLONG(X102))","v":""},"","","","",null,"",null,"",null,"",{"$f":"IF(U102=\"\", O102, MAPSYMBOL(O102, U102, $O$8))","v":""},"",null,null,null,null,null,null,null,null,null,""]
[87,{"$f":"IF(W103=\"\",\"\",GETLat(W103))","v":""},{"$f":"IF(X103=\"\",\"\",GETLONG(X103))","v":""},"","","","",null,"",null,"",null,"",{"$f":"IF(U103=\"\", O103, MAPSYMBOL(O103, U103, $O$8))","v":""},"",null,null,null,null,null,null,null,null,null,""]
[88,{"$f":"IF(W104=\"\",\"\",GETLat(W104))","v":""},{"$f":"IF(X104=\"\",\"\",GETLONG(X104))","v":""},"","","","",null,"",null,"",null,"",{"$f":"IF(U104=\"\", O104, MAPSYMBOL(O104, U104, $O$8))","v":""},"",null,null,null,null,null,null,null,null,null,""]
[89,{"$f":"IF(W105=\"\",\"\",GETLat(W105))","v":""},{"$f":"IF(X105=\"\",\"\",GETLONG(X105))","v":""},"","","","",null,"",null,"",null,"",{"$f":"IF(U105=\"\", O105, MAPSYMBOL(O105, U105, $O$8))","v":""},"",null,null,null,null,null,null,null,null,null,""]
[90,{"$f":"IF(W106=\"\",\"\",GETLat(W106))","v":""},{"$f":"IF(X106=\"\",\"\",GETLONG(X106))","v":""},"","","","",null,"",null,"",null,"",{"$f":"IF(U106=\"\", O106, MAPSYMBOL(O106, U106, $O$8))","v":""},"",null,null,null,null,null,null,null,null,null,""]
[91,{"$f":"IF(W107=\"\",\"\",GETLat(W107))","v":""},{"$f":"IF(X107=\"\",\"\",GETLONG(X107))","v":""},"","","","",null,"",null,"",null,"",{"$f":"IF(U107=\"\", O107, MAPSYMBOL(O107, U107, $O$8))","v":""},"",null,null,null,null,null,null,null,null,null,""]
[92,{"$f":"IF(W108=\"\",\"\",GETLat(W108))","v":""},{"$f":"IF(X108=\"\",\"\",GETLONG(X108))","v":""},"","","","",null,"",null,"",null,"",{"$f":"IF(U108=\"\", O108, MAPSYMBOL(O108, U108, $O$8))","v":""},"",null,null,null,null,null,null,null,null,null,""]
[93,{"$f":"IF(W109=\"\",\"\",GETLat(W109))","v":""},{"$f":"IF(X109=\"\",\"\",GETLONG(X109))","v":""},"","","","",null,"",null,"",null,"",{"$f":"IF(U109=\"\", O109, MAPSYMBOL(O109, U109, $O$8))","v":""},"",null,null,null,null,null,null,null,null,null,""]
[94,{"$f":"IF(W110=\"\",\"\",GETLat(W110))","v":""},{"$f":"IF(X110=\"\",\"\",GETLONG(X110))","v":""},"","","","",null,"",null,"",null,"",{"$f":"IF(U110=\"\", O110, MAPSYMBOL(O110, U110, $O$8))","v":""},"",null,null,null,null,null,null,null,null,null,""]
[95,{"$f":"IF(W111=\"\",\"\",GETLat(W111))","v":""},{"$f":"IF(X111=\"\",\"\",GETLONG(X111))","v":""},"","","","",null,"",null,"",null,"",{"$f":"IF(U111=\"\", O111, MAPSYMBOL(O111, U111, $O$8))","v":""},"",null,null,null,null,null,null,null,null,null,""]
[96,{"$f":"IF(W112=\"\",\"\",GETLat(W112))","v":""},{"$f":"IF(X112=\"\",\"\",GETLONG(X112))","v":""},"","","","",null,"",null,"",null,"",{"$f":"IF(U112=\"\", O112, MAPSYMBOL(O112, U112, $O$8))","v":""},"",null,null,null,null,null,null,null,null,null,""]
[97,{"$f":"IF(W113=\"\",\"\",GETLat(W113))","v":""},{"$f":"IF(X113=\"\",\"\",GETLONG(X113))","v":""},"","","","",null,"",null,"",null,"",{"$f":"IF(U113=\"\", O113, MAPSYMBOL(O113, U113, $O$8))","v":""},"",null,null,null,null,null,null,null,null,null,""]
[98,{"$f":"IF(W114=\"\",\"\",GETLat(W114))","v":""},{"$f":"IF(X114=\"\",\"\",GETLONG(X114))","v":""},"","","","",null,"",null,"",null,"",{"$f":"IF(U114=\"\", O114, MAPSYMBOL(O114, U114, $O$8))","v":""},"",null,null,null,null,null,null,null,null,null,""]
[99,{"$f":"IF(W115=\"\",\"\",GETLat(W115))","v":""},{"$f":"IF(X115=\"\",\"\",GETLONG(X115))","v":""},"","","","",null,"",null,"",null,"",{"$f":"IF(U115=\"\", O115, MAPSYMBOL(O115, U115, $O$8))","v":""},"",null,null,null,null,null,null,null,null,null,""]
[100,{"$f":"IF(W116=\"\",\"\",GETLat(W116))","v":""},{"$f":"IF(X116=\"\",\"\",GETLONG(X116))","v":""},"","","","",null,"",null,"",null,"",{"$f":"IF(U116=\"\", O116, MAPSYMBOL(O116, U116, $O$8))","v":""},"",null,null,null,null,null,null,null,null,null,""]
[101,{"$f":"IF(W117=\"\",\"\",GETLat(W117))","v":""},{"$f":"IF(X117=\"\",\"\",GETLONG(X117))","v":""},"","","","",null,"",null,"",null,"",{"$f":"IF(U117=\"\", O117, MAPSYMBOL(O117, U117, $O$8))","v":""},"",null,null,null,null,null,null,null,null,null,""]
[102,{"$f":"IF(W118=\"\",\"\",GETLat(W118))","v":""},{"$f":"IF(X118=\"\",\"\",GETLONG(X118))","v":""},"","","","",null,"",null,"",null,"",{"$f":"IF(U118=\"\", O118, MAPSYMBOL(O118, U118, $O$8))","v":""},"",null,null,null,null,null,null,null,null,null,""]
[103,{"$f":"IF(W119=\"\",\"\",GETLat(W119))","v":""},{"$f":"IF(X119=\"\",\"\",GETLONG(X119))","v":""},"","","","",null,"",null,"",null,"",{"$f":"IF(U119=\"\", O119, MAPSYMBOL(O119, U119, $O$8))","v":""},"",null,null,null,null,null,null,null,null,null,""]
[104,{"$f":"IF(W120=\"\",\"\",GETLat(W120))","v":""},{"$f":"IF(X120=\"\",\"\",GETLONG(X120))","v":""},"","","","",null,"",null,"",null,"",{"$f":"IF(U120=\"\", O120, MAPSYMBOL(O120, U120, $O$8))","v":""},"",null,null,null,null,null,null,null,null,null,""]
[105,{"$f":"IF(W121=\"\",\"\",GETLat(W121))","v":""},{"$f":"IF(X121=\"\",\"\",GETLONG(X121))","v":""},"","","","",null,"",null,"",null,"",{"$f":"IF(U121=\"\", O121, MAPSYMBOL(O121, U121, $O$8))","v":""},"",null,null,null,null,null,null,null,null,null,""]
[106,{"$f":"IF(W122=\"\",\"\",GETLat(W122))","v":""},{"$f":"IF(X122=\"\",\"\",GETLONG(X122))","v":""},"","","","",null,"",null,"",null,"",{"$f":"IF(U122=\"\", O122, MAPSYMBOL(O122, U122, $O$8))","v":""},"",null,null,null,null,null,null,null,null,null,""]
[107,{"$f":"IF(W123=\"\",\"\",GETLat(W123))","v":""},{"$f":"IF(X123=\"\",\"\",GETLONG(X123))","v":""},"","","","",null,"",null,"",null,"",{"$f":"IF(U123=\"\", O123, MAPSYMBOL(O123, U123, $O$8))","v":""},"",null,null,null,null,null,null,null,null,null,""]
[108,{"$f":"IF(W124=\"\",\"\",GETLat(W124))","v":""},{"$f":"IF(X124=\"\",\"\",GETLONG(X124))","v":""},"","","","",null,"",null,"",null,"",{"$f":"IF(U124=\"\", O124, MAPSYMBOL(O124, U124, $O$8))","v":""},"",null,null,null,null,null,null,null,null,null,""]
[109,{"$f":"IF(W125=\"\",\"\",GETLat(W125))","v":""},{"$f":"IF(X125=\"\",\"\",GETLONG(X125))","v":""},"","","","",null,"",null,"",null,"",{"$f":"IF(U125=\"\", O125, MAPSYMBOL(O125, U125, $O$8))","v":""},"",null,null,null,null,null,null,null,null,null,""]
[110,{"$f":"IF(W126=\"\",\"\",GETLat(W126))","v":""},{"$f":"IF(X126=\"\",\"\",GETLONG(X126))","v":""},"","","","",null,"",null,"",null,"",{"$f":"IF(U126=\"\", O126, MAPSYMBOL(O126, U126, $O$8))","v":""},"",null,null,null,null,null,null,null,null,null,""]
[111,{"$f":"IF(W127=\"\",\"\",GETLat(W127))","v":""},{"$f":"IF(X127=\"\",\"\",GETLONG(X127))","v":""},"","","","",null,"",null,"",null,"",{"$f":"IF(U127=\"\", O127, MAPSYMBOL(O127, U127, $O$8))","v":""},"",null,null,null,null,null,null,null,null,null,""]
[112,{"$f":"IF(W128=\"\",\"\",GETLat(W128))","v":""},{"$f":"IF(X128=\"\",\"\",GETLONG(X128))","v":""},"","","","",null,"",null,"",null,"",{"$f":"IF(U128=\"\", O128, MAPSYMBOL(O128, U128, $O$8))","v":""},"",null,null,null,null,null,null,null,null,null,""]
[113,{"$f":"IF(W129=\"\",\"\",GETLat(W129))","v":""},{"$f":"IF(X129=\"\",\"\",GETLONG(X129))","v":""},"","","","",null,"",null,"",null,"",{"$f":"IF(U129=\"\", O129, MAPSYMBOL(O129, U129, $O$8))","v":""},"",null,null,null,null,null,null,null,null,null,""]
[114,{"$f":"IF(W130=\"\",\"\",GETLat(W130))","v":""},{"$f":"IF(X130=\"\",\"\",GETLONG(X130))","v":""},"","","","",null,"",null,"",null,"",{"$f":"IF(U130=\"\", O130, MAPSYMBOL(O130, U130, $O$8))","v":""},"",null,null,null,null,null,null,null,null,null,""]
[115,{"$f":"IF(W131=\"\",\"\",GETLat(W131))","v":""},{"$f":"IF(X131=\"\",\"\",GETLONG(X131))","v":""},"","","","",null,"",null,"",null,"",{"$f":"IF(U131=\"\", O131, MAPSYMBOL(O131, U131, $O$8))","v":""},"",null,null,null,null,null,null,null,null,null,""]
[116,{"$f":"IF(W132=\"\",\"\",GETLat(W132))","v":""},{"$f":"IF(X132=\"\",\"\",GETLONG(X132))","v":""},"","","","",null,"",null,"",null,"",{"$f":"IF(U132=\"\", O132, MAPSYMBOL(O132, U132, $O$8))","v":""},"",null,null,null,null,null,null,null,null,null,""]
[117,{"$f":"IF(W133=\"\",\"\",GETLat(W133))","v":""},{"$f":"IF(X133=\"\",\"\",GETLONG(X133))","v":""},"","","","",null,"",null,"",null,"",{"$f":"IF(U133=\"\", O133, MAPSYMBOL(O133, U133, $O$8))","v":""},"",null,null,null,null,null,null,null,null,null,""]
[118,{"$f":"IF(W134=\"\",\"\",GETLat(W134))","v":""},{"$f":"IF(X134=\"\",\"\",GETLONG(X134))","v":""},"","","","",null,"",null,"",null,"",{"$f":"IF(U134=\"\", O134, MAPSYMBOL(O134, U134, $O$8))","v":""},"",null,null,null,null,null,null,null,null,null,""]
[119,{"$f":"IF(W135=\"\",\"\",GETLat(W135))","v":""},{"$f":"IF(X135=\"\",\"\",GETLONG(X135))","v":""},"","","","",null,"",null,"",null,"",{"$f":"IF(U135=\"\", O135, MAPSYMBOL(O135, U135, $O$8))","v":""},"",null,null,null,null,null,null,null,null,null,""]
[120,{"$f":"IF(W136=\"\",\"\",GETLat(W136))","v":""},{"$f":"IF(X136=\"\",\"\",GETLONG(X136))","v":""},"","","","",null,"",null,"",null,"",{"$f":"IF(U136=\"\", O136, MAPSYMBOL(O136, U136, $O$8))","v":""},"",null,null,null,null,null,null,null,null,null,""]
[121,{"$f":"IF(W137=\"\",\"\",GETLat(W137))","v":""},{"$f":"IF(X137=\"\",\"\",GETLONG(X137))","v":""},"","","","",null,"",null,"",null,"",{"$f":"IF(U137=\"\", O137, MAPSYMBOL(O137, U137, $O$8))","v":""},"",null,null,null,null,null,null,null,null,null,""]
[122,{"$f":"IF(W138=\"\",\"\",GETLat(W138))","v":""},{"$f":"IF(X138=\"\",\"\",GETLONG(X138))","v":""},"","","","",null,"",null,"",null,"",{"$f":"IF(U138=\"\", O138, MAPSYMBOL(O138, U138, $O$8))","v":""},"",null,null,null,null,null,null,null,null,null,""]
[123,{"$f":"IF(W139=\"\",\"\",GETLat(W139))","v":""},{"$f":"IF(X139=\"\",\"\",GETLONG(X139))","v":""},"","","","",null,"",null,"",null,"",{"$f":"IF(U139=\"\", O139, MAPSYMBOL(O139, U139, $O$8))","v":""},"",null,null,null,null,null,null,null,null,null,""]
[124,{"$f":"IF(W140=\"\",\"\",GETLat(W140))","v":""},{"$f":"IF(X140=\"\",\"\",GETLONG(X140))","v":""},"","","","",null,"",null,"",null,"",{"$f":"IF(U140=\"\", O140, MAPSYMBOL(O140, U140, $O$8))","v":""},"",null,null,null,null,null,null,null,null,null,""]
[125,{"$f":"IF(W141=\"\",\"\",GETLat(W141))","v":""},{"$f":"IF(X141=\"\",\"\",GETLONG(X141))","v":""},"","","","",null,"",null,"",null,"",{"$f":"IF(U141=\"\", O141, MAPSYMBOL(O141, U141, $O$8))","v":""},"",null,null,null,null,null,null,null,null,null,""]
[126,{"$f":"IF(W142=\"\",\"\",GETLat(W142))","v":""},{"$f":"IF(X142=\"\",\"\",GETLONG(X142))","v":""},"","","","",null,"",null,"",null,"",{"$f":"IF(U142=\"\", O142, MAPSYMBOL(O142, U142, $O$8))","v":""},"",null,null,null,null,null,null,null,null,null,""]
[127,{"$f":"IF(W143=\"\",\"\",GETLat(W143))","v":""},{"$f":"IF(X143=\"\",\"\",GETLONG(X143))","v":""},"","","","",null,"",null,"",null,"",{"$f":"IF(U143=\"\", O143, MAPSYMBOL(O143, U143, $O$8))","v":""},"",null,null,null,null,null,null,null,null,null,""]
[128,{"$f":"IF(W144=\"\",\"\",GETLat(W144))","v":""},{"$f":"IF(X144=\"\",\"\",GETLONG(X144))","v":""},"","","","",null,"",null,"",null,"",{"$f":"IF(U144=\"\", O144, MAPSYMBOL(O144, U144, $O$8))","v":""},"",null,null,null,null,null,null,null,null,null,""]
[129,{"$f":"IF(W145=\"\",\"\",GETLat(W145))","v":""},{"$f":"IF(X145=\"\",\"\",GETLONG(X145))","v":""},{"$f":"NamePlus($O$7, S145, T145, U145, V145)","v":""},{"$f":"IF(V145=\"\",\"\",V145)","v":""},{"$f":"IF(T145=\"\",\"\",IF($F$9 = TRUE,T145,\"\"))","v":""},{"$f":"N145","v":""},null,{"$f":"IF(S145=\"\",\"\",S145)","v":""},null,{"$f":"IF(J145<>\"\",T145,\"\")","v":""},null,{"$f":"IF(T145=\"\",\"\",T145)","v":""},{"$f":"IF(U145=\"\", O145, MAPSYMBOL(O145, U145, $O$8))","v":""},{"$f":"IF(OR(W145=\"\",X145=\"\"),\"\",VLOOKUP(T145,$M$4:$N$12,2,TRUE))","v":""},null,null,null,null,null,null,null,null,null,""]
[130,{"$f":"IF(W146=\"\",\"\",GETLat(W146))","v":""},{"$f":"IF(X146=\"\",\"\",GETLONG(X146))","v":""},"","","","",null,"",null,"",null,"",{"$f":"IF(U146=\"\", O146, MAPSYMBOL(O146, U146, $O$8))","v":""},"",null,null,null,null,null,null,null,null,null,{"$f":"IF(OR(W146=\"\",X146=\"\"),\"\",HYPERLINK(\"https://maps.google.com/maps?q=\"&B146&\",\"&C146))","v":""}]
[131,{"$f":"IF(W147=\"\",\"\",GETLat(W147))","v":""},{"$f":"IF(X147=\"\",\"\",GETLONG(X147))","v":""},"","","","",null,"",null,"",null,"",{"$f":"IF(U147=\"\", O147, MAPSYMBOL(O147, U147, $O$8))","v":""},"",null,null,null,null,null,null,null,null,null,""]
[132,{"$f":"IF(W148=\"\",\"\",GETLat(W148))","v":""},{"$f":"IF(X148=\"\",\"\",GETLONG(X148))","v":""},"","","","",null,"",null,"",null,"",{"$f":"IF(U148=\"\", O148, MAPSYMBOL(O148, U148, $O$8))","v":""},"",null,null,null,null,null,null,null,null,null,""]
[133,{"$f":"IF(W149=\"\",\"\",GETLat(W149))","v":""},{"$f":"IF(X149=\"\",\"\",GETLONG(X149))","v":""},"","","","",null,"",null,"",null,"",{"$f":"IF(U149=\"\", O149, MAPSYMBOL(O149, U149, $O$8))","v":""},"",null,null,null,null,null,null,null,null,null,""]
[134,{"$f":"IF(W150=\"\",\"\",GETLat(W150))","v":""},{"$f":"IF(X150=\"\",\"\",GETLONG(X150))","v":""},"","","","",null,"",null,"",null,"",{"$f":"IF(U150=\"\", O150, MAPSYMBOL(O150, U150, $O$8))","v":""},"",null,null,null,null,null,null,null,null,null,""]
[135,{"$f":"IF(W151=\"\",\"\",GETLat(W151))","v":""},{"$f":"IF(X151=\"\",\"\",GETLONG(X151))","v":""},"","","","",null,"",null,"",null,"",{"$f":"IF(U151=\"\", O151, MAPSYMBOL(O151, U151, $O$8))","v":""},"",null,null,null,null,null,null,null,null,null,""]
[136,{"$f":"IF(W152=\"\",\"\",GETLat(W152))","v":""},{"$f":"IF(X152=\"\",\"\",GETLONG(X152))","v":""},"","","","",null,"",null,"",null,"",{"$f":"IF(U152=\"\", O152, MAPSYMBOL(O152, U152, $O$8))","v":""},"",null,null,null,null,null,null,null,null,null,""]
[137,{"$f":"IF(W153=\"\",\"\",GETLat(W153))","v":""},{"$f":"IF(X153=\"\",\"\",GETLONG(X153))","v":""},"","","","",null,"",null,"",null,"",{"$f":"IF(U153=\"\", O153, MAPSYMBOL(O153, U153, $O$8))","v":""},"",null,null,null,null,null,null,null,null,null,""]
[138,{"$f":"IF(W154=\"\",\"\",GETLat(W154))","v":""},{"$f":"IF(X154=\"\",\"\",GETLONG(X154))","v":""},"","","","",null,"",null,"",null,"",{"$f":"IF(U154=\"\", O154, MAPSYMBOL(O154, U154, $O$8))","v":""},"",null,null,null,null,null,null,null,null,null,""]
[139,{"$f":"IF(W155=\"\",\"\",GETLat(W155))","v":""},{"$f":"IF(X155=\"\",\"\",GETLONG(X155))","v":""},"","","","",null,"",null,"",null,"",{"$f":"IF(U155=\"\", O155, MAPSYMBOL(O155, U155, $O$8))","v":""},"",null,null,null,null,null,null,null,null,null,""]
[140,{"$f":"IF(W156=\"\",\"\",GETLat(W156))","v":""},{"$f":"IF(X156=\"\",\"\",GETLONG(X156))","v":""},"","","","",null,"",null,"",null,"",{"$f":"IF(U156=\"\", O156, MAPSYMBOL(O156, U156, $O$8))","v":""},"",null,null,null,null,null,null,null,null,null,""]
[141,{"$f":"IF(W157=\"\",\"\",GETLat(W157))","v":""},{"$f":"IF(X157=\"\",\"\",GETLONG(X157))","v":""},"","","","",null,"",null,"",null,"",{"$f":"IF(U157=\"\", O157, MAPSYMBOL(O157, U157, $O$8))","v":""},"",null,null,null,null,null,null,null,null,null,""]
[142,{"$f":"IF(W158=\"\",\"\",GETLat(W158))","v":""},{"$f":"IF(X158=\"\",\"\",GETLONG(X158))","v":""},"","","","",null,"",null,"",null,"",{"$f":"IF(U158=\"\", O158, MAPSYMBOL(O158, U158, $O$8))","v":""},"",null,null,null,null,null,null,null,null,null,""]
[143,{"$f":"IF(W159=\"\",\"\",GETLat(W159))","v":""},{"$f":"IF(X159=\"\",\"\",GETLONG(X159))","v":""},"","","","",null,"",null,"",null,"",{"$f":"IF(U159=\"\", O159, MAPSYMBOL(O159, U159, $O$8))","v":""},"",null,null,null,null,null,null,null,null,null,""]
[144,{"$f":"IF(W160=\"\",\"\",GETLat(W160))","v":""},{"$f":"IF(X160=\"\",\"\",GETLONG(X160))","v":""},"","","","",null,"",null,"",null,"",{"$f":"IF(U160=\"\", O160, MAPSYMBOL(O160, U160, $O$8))","v":""},"",null,null,null,null,null,null,null,null,null,""]
[145,{"$f":"IF(W161=\"\",\"\",GETLat(W161))","v":""},{"$f":"IF(X161=\"\",\"\",GETLONG(X161))","v":""},"","","","",null,"",null,"",null,"",{"$f":"IF(U161=\"\", O161, MAPSYMBOL(O161, U161, $O$8))","v":""},"",null,null,null,null,null,null,null,null,null,""]
[146,{"$f":"IF(W162=\"\",\"\",GETLat(W162))","v":""},{"$f":"IF(X162=\"\",\"\",GETLONG(X162))","v":""},"","","","",null,"",null,"",null,"",{"$f":"IF(U162=\"\", O162, MAPSYMBOL(O162, U162, $O$8))","v":""},"",null,null,null,null,null,null,null,null,null,""]
[147,{"$f":"IF(W163=\"\",\"\",GETLat(W163))","v":""},{"$f":"IF(X163=\"\",\"\",GETLONG(X163))","v":""},"","","","",null,"",null,"",null,"",{"$f":"IF(U163=\"\", O163, MAPSYMBOL(O163, U163, $O$8))","v":""},"",null,null,null,null,null,null,null,null,null,""]
[148,{"$f":"IF(W164=\"\",\"\",GETLat(W164))","v":""},{"$f":"IF(X164=\"\",\"\",GETLONG(X164))","v":""},"","","","",null,"",null,"",null,"",{"$f":"IF(U164=\"\", O164, MAPSYMBOL(O164, U164, $O$8))","v":""},"",null,null,null,null,null,null,null,null,null,""]
[149,{"$f":"IF(W165=\"\",\"\",GETLat(W165))","v":""},{"$f":"IF(X165=\"\",\"\",GETLONG(X165))","v":""},"","","","",null,"",null,"",null,"",{"$f":"IF(U165=\"\", O165, MAPSYMBOL(O165, U165, $O$8))","v":""},"",null,null,null,null,null,null,null,null,null,""]
[150,{"$f":"IF(W166=\"\",\"\",GETLat(W166))","v":""},{"$f":"IF(X166=\"\",\"\",GETLONG(X166))","v":""},"","","","",null,"",null,"",null,"",{"$f":"IF(U166=\"\", O166, MAPSYMBOL(O166, U166, $O$8))","v":""},"",null,null,null,null,null,null,null,null,null,""]
[151,{"$f":"IF(W167=\"\",\"\",GETLat(W167))","v":""},{"$f":"IF(X167=\"\",\"\",GETLONG(X167))","v":""},"","","","",null,"",null,"",null,"",{"$f":"IF(U167=\"\", O167, MAPSYMBOL(O167, U167, $O$8))","v":""},"",null,null,null,null,null,null,null,null,null,""]
[152,{"$f":"IF(W168=\"\",\"\",GETLat(W168))","v":""},{"$f":"IF(X168=\"\",\"\",GETLONG(X168))","v":""},"","","","",null,"",null,"",null,"",{"$f":"IF(U168=\"\", O168, MAPSYMBOL(O168, U168, $O$8))","v":""},"",null,null,null,null,null,null,null,null,null,""]
[153,{"$f":"IF(W169=\"\",\"\",GETLat(W169))","v":""},{"$f":"IF(X169=\"\",\"\",GETLONG(X169))","v":""},"","","","",null,"",null,"",null,"",{"$f":"IF(U169=\"\", O169, MAPSYMBOL(O169, U169, $O$8))","v":""},"",null,null,null,null,null,null,null,null,null,""]
[154,{"$f":"IF(W170=\"\",\"\",GETLat(W170))","v":""},{"$f":"IF(X170=\"\",\"\",GETLONG(X170))","v":""},"","","","",null,"",null,"",null,"",{"$f":"IF(U170=\"\", O170, MAPSYMBOL(O170, U170, $O$8))","v":""},"",null,null,null,null,null,null,null,null,null,""]
[155,{"$f":"IF(W171=\"\",\"\",GETLat(W171))","v":""},{"$f":"IF(X171=\"\",\"\",GETLONG(X171))","v":""},"","","","",null,"",null,"",null,"",{"$f":"IF(U171=\"\", O171, MAPSYMBOL(O171, U171, $O$8))","v":""},"",null,null,null,null,null,null,null,null,null,""]
[156,{"$f":"IF(W172=\"\",\"\",GETLat(W172))","v":""},{"$f":"IF(X172=\"\",\"\",GETLONG(X172))","v":""},"","","","",null,"",null,"",null,"",{"$f":"IF(U172=\"\", O172, MAPSYMBOL(O172, U172, $O$8))","v":""},"",null,null,null,null,null,null,null,null,null,""]
[157,{"$f":"IF(W173=\"\",\"\",GETLat(W173))","v":""},{"$f":"IF(X173=\"\",\"\",GETLONG(X173))","v":""},"","","","",null,"",null,"",null,"",{"$f":"IF(U173=\"\", O173, MAPSYMBOL(O173, U173, $O$8))","v":""},"",null,null,null,null,null,null,null,null,null,""]
[158,{"$f":"IF(W174=\"\",\"\",GETLat(W174))","v":""},{"$f":"IF(X174=\"\",\"\",GETLONG(X174))","v":""},"","","","",null,"",null,"",null,"",{"$f":"IF(U174=\"\", O174, MAPSYMBOL(O174, U174, $O$8))","v":""},"",null,null,null,null,null,null,null,null,null,""]
[159,{"$f":"IF(W175=\"\",\"\",GETLat(W175))","v":""},{"$f":"IF(X175=\"\",\"\",GETLONG(X175))","v":""},"","","","",null,"",null,"",null,"",{"$f":"IF(U175=\"\", O175, MAPSYMBOL(O175, U175, $O$8))","v":""},"",null,null,null,null,null,null,null,null,null,""]
[160,{"$f":"IF(W176=\"\",\"\",GETLat(W176))","v":""},{"$f":"IF(X176=\"\",\"\",GETLONG(X176))","v":""},"","","","",null,"",null,"",null,"",{"$f":"IF(U176=\"\", O176, MAPSYMBOL(O176, U176, $O$8))","v":""},"",null,null,null,null,null,null,null,null,null,""]
[161,{"$f":"IF(W177=\"\",\"\",GETLat(W177))","v":""},{"$f":"IF(X177=\"\",\"\",GETLONG(X177))","v":""},"","","","",null,"",null,"",null,"",{"$f":"IF(U177=\"\", O177, MAPSYMBOL(O177, U177, $O$8))","v":""},"",null,null,null,null,null,null,null,null,null,""]
[162,{"$f":"IF(W178=\"\",\"\",GETLat(W178))","v":""},{"$f":"IF(X178=\"\",\"\",GETLONG(X178))","v":""},"","","","",null,"",null,"",null,"",{"$f":"IF(U178=\"\", O178, MAPSYMBOL(O178, U178, $O$8))","v":""},"",null,null,null,null,null,null,null,null,null,""]
[163,{"$f":"IF(W179=\"\",\"\",GETLat(W179))","v":""},{"$f":"IF(X179=\"\",\"\",GETLONG(X179))","v":""},"","","","",null,"",null,"",null,"",{"$f":"IF(U179=\"\", O179, MAPSYMBOL(O179, U179, $O$8))","v":""},"",null,null,null,null,null,null,null,null,null,""]
[164,{"$f":"IF(W180=\"\",\"\",GETLat(W180))","v":""},{"$f":"IF(X180=\"\",\"\",GETLONG(X180))","v":""},"","","","",null,"",null,"",null,"",{"$f":"IF(U180=\"\", O180, MAPSYMBOL(O180, U180, $O$8))","v":""},"",null,null,null,null,null,null,null,null,null,""]
[165,{"$f":"IF(W181=\"\",\"\",GETLat(W181))","v":""},{"$f":"IF(X181=\"\",\"\",GETLONG(X181))","v":""},"","","","",null,"",null,"",null,"",{"$f":"IF(U181=\"\", O181, MAPSYMBOL(O181, U181, $O$8))","v":""},"",null,null,null,null,null,null,null,null,null,""]
[166,{"$f":"IF(W182=\"\",\"\",GETLat(W182))","v":""},{"$f":"IF(X182=\"\",\"\",GETLONG(X182))","v":""},"","","","",null,"",null,"",null,"",{"$f":"IF(U182=\"\", O182, MAPSYMBOL(O182, U182, $O$8))","v":""},"",null,null,null,null,null,null,null,null,null,""]
[167,{"$f":"IF(W183=\"\",\"\",GETLat(W183))","v":""},{"$f":"IF(X183=\"\",\"\",GETLONG(X183))","v":""},"","","","",null,"",null,"",null,"",{"$f":"IF(U183=\"\", O183, MAPSYMBOL(O183, U183, $O$8))","v":""},"",null,null,null,null,null,null,null,null,null,""]
[168,{"$f":"IF(W184=\"\",\"\",GETLat(W184))","v":""},{"$f":"IF(X184=\"\",\"\",GETLONG(X184))","v":""},"","","","",null,"",null,"",null,"",{"$f":"IF(U184=\"\", O184, MAPSYMBOL(O184, U184, $O$8))","v":""},"",null,null,null,null,null,null,null,null,null,""]
[169,{"$f":"IF(W185=\"\",\"\",GETLat(W185))","v":""},{"$f":"IF(X185=\"\",\"\",GETLONG(X185))","v":""},"","","","",null,"",null,"",null,"",{"$f":"IF(U185=\"\", O185, MAPSYMBOL(O185, U185, $O$8))","v":""},"",null,null,null,null,null,null,null,null,null,""]
[170,{"$f":"IF(W186=\"\",\"\",GETLat(W186))","v":""},{"$f":"IF(X186=\"\",\"\",GETLONG(X186))","v":""},"","","","",null,"",null,"",null,"",{"$f":"IF(U186=\"\", O186, MAPSYMBOL(O186, U186, $O$8))","v":""},"",null,null,null,null,null,null,null,null,null,""]
[171,{"$f":"IF(W187=\"\",\"\",GETLat(W187))","v":""},{"$f":"IF(X187=\"\",\"\",GETLONG(X187))","v":""},"","","","",null,"",null,"",null,"",{"$f":"IF(U187=\"\", O187, MAPSYMBOL(O187, U187, $O$8))","v":""},"",null,null,null,null,null,null,null,null,null,""]
[172,{"$f":"IF(W188=\"\",\"\",GETLat(W188))","v":""},{"$f":"IF(X188=\"\",\"\",GETLONG(X188))","v":""},"","","","",null,"",null,"",null,"",{"$f":"IF(U188=\"\", O188, MAPSYMBOL(O188, U188, $O$8))","v":""},"",null,null,null,null,null,null,null,null,null,""]
[173,{"$f":"IF(W189=\"\",\"\",GETLat(W189))","v":""},{"$f":"IF(X189=\"\",\"\",GETLONG(X189))","v":""},"","","","",null,"",null,"",null,"",{"$f":"IF(U189=\"\", O189, MAPSYMBOL(O189, U189, $O$8))","v":""},"",null,null,null,null,null,null,null,null,null,""]
[174,{"$f":"IF(W190=\"\",\"\",GETLat(W190))","v":""},{"$f":"IF(X190=\"\",\"\",GETLONG(X190))","v":""},"","","","",null,"",null,"",null,"",{"$f":"IF(U190=\"\", O190, MAPSYMBOL(O190, U190, $O$8))","v":""},"",null,null,null,null,null,null,null,null,null,""]
[175,{"$f":"IF(W191=\"\",\"\",GETLat(W191))","v":""},{"$f":"IF(X191=\"\",\"\",GETLONG(X191))","v":""},"","","","",null,"",null,"",null,"",{"$f":"IF(U191=\"\", O191, MAPSYMBOL(O191, U191, $O$8))","v":""},"",null,null,null,null,null,null,null,null,null,""]
[176,{"$f":"IF(W192=\"\",\"\",GETLat(W192))","v":""},{"$f":"IF(X192=\"\",\"\",GETLONG(X192))","v":""},"","","","",null,"",null,"",null,"",{"$f":"IF(U192=\"\", O192, MAPSYMBOL(O192, U192, $O$8))","v":""},"",null,null,null,null,null,null,null,null,null,""]
[177,{"$f":"IF(W193=\"\",\"\",GETLat(W193))","v":""},{"$f":"IF(X193=\"\",\"\",GETLONG(X193))","v":""},"","","","",null,"",null,"",null,"",{"$f":"IF(U193=\"\", O193, MAPSYMBOL(O193, U193, $O$8))","v":""},"",null,null,null,null,null,null,null,null,null,""]
[178,{"$f":"IF(W194=\"\",\"\",GETLat(W194))","v":""},{"$f":"IF(X194=\"\",\"\",GETLONG(X194))","v":""},"","","","",null,"",null,"",null,"",{"$f":"IF(U194=\"\", O194, MAPSYMBOL(O194, U194, $O$8))","v":""},"",null,null,null,null,null,null,null,null,null,""]
[179,{"$f":"IF(W195=\"\",\"\",GETLat(W195))","v":""},{"$f":"IF(X195=\"\",\"\",GETLONG(X195))","v":""},"","","","",null,"",null,"",null,"",{"$f":"IF(U195=\"\", O195, MAPSYMBOL(O195, U195, $O$8))","v":""},"",null,null,null,null,null,null,null,null,null,""]
[180,{"$f":"IF(W196=\"\",\"\",GETLat(W196))","v":""},{"$f":"IF(X196=\"\",\"\",GETLONG(X196))","v":""},"","","","",null,"",null,"",null,"",{"$f":"IF(U196=\"\", O196, MAPSYMBOL(O196, U196, $O$8))","v":""},"",null,null,null,null,null,null,null,null,null,""]
[181,{"$f":"IF(W197=\"\",\"\",GETLat(W197))","v":""},{"$f":"IF(X197=\"\",\"\",GETLONG(X197))","v":""},"","","","",null,"",null,"",null,"",{"$f":"IF(U197=\"\", O197, MAPSYMBOL(O197, U197, $O$8))","v":""},"",null,null,null,null,null,null,null,null,null,""]
[182,{"$f":"IF(W198=\"\",\"\",GETLat(W198))","v":""},{"$f":"IF(X198=\"\",\"\",GETLONG(X198))","v":""},"","","","",null,"",null,"",null,"",{"$f":"IF(U198=\"\", O198, MAPSYMBOL(O198, U198, $O$8))","v":""},"",null,null,null,null,null,null,null,null,null,""]
[183,{"$f":"IF(W199=\"\",\"\",GETLat(W199))","v":""},{"$f":"IF(X199=\"\",\"\",GETLONG(X199))","v":""},"","","","",null,"",null,"",null,"",{"$f":"IF(U199=\"\", O199, MAPSYMBOL(O199, U199, $O$8))","v":""},"",null,null,null,null,null,null,null,null,null,""]
[184,{"$f":"IF(W200=\"\",\"\",GETLat(W200))","v":""},{"$f":"IF(X200=\"\",\"\",GETLONG(X200))","v":""},"","","","",null,"",null,"",null,"",{"$f":"IF(U200=\"\", O200, MAPSYMBOL(O200, U200, $O$8))","v":""},"",null,null,null,null,null,null,null,null,null,""]
[185,{"$f":"IF(W201=\"\",\"\",GETLat(W201))","v":""},{"$f":"IF(X201=\"\",\"\",GETLONG(X201))","v":""},"","","","",null,"",null,"",null,"",{"$f":"IF(U201=\"\", O201, MAPSYMBOL(O201, U201, $O$8))","v":""},"",null,null,null,null,null,null,null,null,null,""]
[186,{"$f":"IF(W202=\"\",\"\",GETLat(W202))","v":""},{"$f":"IF(X202=\"\",\"\",GETLONG(X202))","v":""},"","","","",null,"",null,"",null,"",{"$f":"IF(U202=\"\", O202, MAPSYMBOL(O202, U202, $O$8))","v":""},"",null,null,null,null,null,null,null,null,null,""]
[187,{"$f":"IF(W203=\"\",\"\",GETLat(W203))","v":""},{"$f":"IF(X203=\"\",\"\",GETLONG(X203))","v":""},"","","","",null,"",null,"",null,"",{"$f":"IF(U203=\"\", O203, MAPSYMBOL(O203, U203, $O$8))","v":""},"",null,null,null,null,null,null,null,null,null,""]
[188,{"$f":"IF(W204=\"\",\"\",GETLat(W204))","v":""},{"$f":"IF(X204=\"\",\"\",GETLONG(X204))","v":""},"","","","",null,"",null,"",null,"",{"$f":"IF(U204=\"\", O204, MAPSYMBOL(O204, U204, $O$8))","v":""},"",null,null,null,null,null,null,null,null,null,""]
[189,{"$f":"IF(W205=\"\",\"\",GETLat(W205))","v":""},{"$f":"IF(X205=\"\",\"\",GETLONG(X205))","v":""},"","","","",null,"",null,"",null,"",{"$f":"IF(U205=\"\", O205, MAPSYMBOL(O205, U205, $O$8))","v":""},"",null,null,null,null,null,null,null,null,null,""]
[190,{"$f":"IF(W206=\"\",\"\",GETLat(W206))","v":""},{"$f":"IF(X206=\"\",\"\",GETLONG(X206))","v":""},"","","","",null,"",null,"",null,"",{"$f":"IF(U206=\"\", O206, MAPSYMBOL(O206, U206, $O$8))","v":""},"",null,null,null,null,null,null,null,null,null,""]
[191,{"$f":"IF(W207=\"\",\"\",GETLat(W207))","v":""},{"$f":"IF(X207=\"\",\"\",GETLONG(X207))","v":""},"","","","",null,"",null,"",null,"",{"$f":"IF(U207=\"\", O207, MAPSYMBOL(O207, U207, $O$8))","v":""},"",null,null,null,null,null,null,null,null,null,""]
[192,{"$f":"IF(W208=\"\",\"\",GETLat(W208))","v":""},{"$f":"IF(X208=\"\",\"\",GETLONG(X208))","v":""},"","","","",null,"",null,"",null,"",{"$f":"IF(U208=\"\", O208, MAPSYMBOL(O208, U208, $O$8))","v":""},"",null,null,null,null,null,null,null,null,null,""]
[193,{"$f":"IF(W209=\"\",\"\",GETLat(W209))","v":""},{"$f":"IF(X209=\"\",\"\",GETLONG(X209))","v":""},{"$f":"NamePlus($O$7, S209, T209, U209, V209)","v":""},{"$f":"IF(V209=\"\",\"\",V209)","v":""},{"$f":"IF(T209=\"\",\"\",IF($F$9 = TRUE,T209,\"\"))","v":""},{"$f":"N209","v":""},null,{"$f":"IF(S209=\"\",\"\",S209)","v":""},null,{"$f":"IF(J209<>\"\",T209,\"\")","v":""},null,{"$f":"IF(T209=\"\",\"\",T209)","v":""},{"$f":"IF(U209=\"\", O209, MAPSYMBOL(O209, U209, $O$8))","v":""},{"$f":"IF(OR(W209=\"\",X209=\"\"),\"\",VLOOKUP(T209,$M$4:$N$12,2,TRUE))","v":""},null,null,null,null,null,null,null,null,null,""]
[194,{"$f":"IF(W210=\"\",\"\",GETLat(W210))","v":""},{"$f":"IF(X210=\"\",\"\",GETLONG(X210))","v":""},"","","","",null,"",null,"",null,"",{"$f":"IF(U210=\"\", O210, MAPSYMBOL(O210, U210, $O$8))","v":""},"",null,null,null,null,null,null,null,null,null,{"$f":"IF(OR(W210=\"\",X210=\"\"),\"\",HYPERLINK(\"https://maps.google.com/maps?q=\"&B210&\",\"&C210))","v":""}]
[195,{"$f":"IF(W211=\"\",\"\",GETLat(W211))","v":""},{"$f":"IF(X211=\"\",\"\",GETLONG(X211))","v":""},"","","","",null,"",null,"",null,"",{"$f":"IF(U211=\"\", O211, MAPSYMBOL(O211, U211, $O$8))","v":""},"",null,null,null,null,null,null,null,null,null,""]
[196,{"$f":"IF(W212=\"\",\"\",GETLat(W212))","v":""},{"$f":"IF(X212=\"\",\"\",GETLONG(X212))","v":""},"","","","",null,"",null,"",null,"",{"$f":"IF(U212=\"\", O212, MAPSYMBOL(O212, U212, $O$8))","v":""},"",null,null,null,null,null,null,null,null,null,""]
[197,{"$f":"IF(W213=\"\",\"\",GETLat(W213))","v":""},{"$f":"IF(X213=\"\",\"\",GETLONG(X213))","v":""},"","","","",null,"",null,"",null,"",{"$f":"IF(U213=\"\", O213, MAPSYMBOL(O213, U213, $O$8))","v":""},"",null,null,null,null,null,null,null,null,null,""]
[198,{"$f":"IF(W214=\"\",\"\",GETLat(W214))","v":""},{"$f":"IF(X214=\"\",\"\",GETLONG(X214))","v":""},"","","","",null,"",null,"",null,"",{"$f":"IF(U214=\"\", O214, MAPSYMBOL(O214, U214, $O$8))","v":""},"",null,null,null,null,null,null,null,null,null,""]
[199,{"$f":"IF(W215=\"\",\"\",GETLat(W215))","v":""},{"$f":"IF(X215=\"\",\"\",GETLONG(X215))","v":""},"","","","",null,"",null,"",null,"",{"$f":"IF(U215=\"\", O215, MAPSYMBOL(O215, U215, $O$8))","v":""},"",null,null,null,null,null,null,null,null,null,""]
[200,{"$f":"IF(W216=\"\",\"\",GETLat(W216))","v":""},{"$f":"IF(X216=\"\",\"\",GETLONG(X216))","v":""},"","","","",null,"",null,"",null,"",{"$f":"IF(U216=\"\", O216, MAPSYMBOL(O216, U216, $O$8))","v":""},"",null,null,null,null,null,null,null,null,null,""]
[201,{"$f":"IF(W217=\"\",\"\",GETLat(W217))","v":""},{"$f":"IF(X217=\"\",\"\",GETLONG(X217))","v":""},"","","","",null,"",null,"",null,"",{"$f":"IF(U217=\"\", O217, MAPSYMBOL(O217, U217, $O$8))","v":""},"",null,null,null,null,null,null,null,null,null,""]
[202,{"$f":"IF(W218=\"\",\"\",GETLat(W218))","v":""},{"$f":"IF(X218=\"\",\"\",GETLONG(X218))","v":""},"","","","",null,"",null,"",null,"",{"$f":"IF(U218=\"\", O218, MAPSYMBOL(O218, U218, $O$8))","v":""},"",null,null,null,null,null,null,null,null,null,""]
[203,{"$f":"IF(W219=\"\",\"\",GETLat(W219))","v":""},{"$f":"IF(X219=\"\",\"\",GETLONG(X219))","v":""},"","","","",null,"",null,"",null,"",{"$f":"IF(U219=\"\", O219, MAPSYMBOL(O219, U219, $O$8))","v":""},"",null,null,null,null,null,null,null,null,null,""]
[204,{"$f":"IF(W220=\"\",\"\",GETLat(W220))","v":""},{"$f":"IF(X220=\"\",\"\",GETLONG(X220))","v":""},"","","","",null,"",null,"",null,"",{"$f":"IF(U220=\"\", O220, MAPSYMBOL(O220, U220, $O$8))","v":""},"",null,null,null,null,null,null,null,null,null,""]
[205,{"$f":"IF(W221=\"\",\"\",GETLat(W221))","v":""},{"$f":"IF(X221=\"\",\"\",GETLONG(X221))","v":""},"","","","",null,"",null,"",null,"",{"$f":"IF(U221=\"\", O221, MAPSYMBOL(O221, U221, $O$8))","v":""},"",null,null,null,null,null,null,null,null,null,""]
[206,{"$f":"IF(W222=\"\",\"\",GETLat(W222))","v":""},{"$f":"IF(X222=\"\",\"\",GETLONG(X222))","v":""},"","","","",null,"",null,"",null,"",{"$f":"IF(U222=\"\", O222, MAPSYMBOL(O222, U222, $O$8))","v":""},"",null,null,null,null,null,null,null,null,null,""]
[207,{"$f":"IF(W223=\"\",\"\",GETLat(W223))","v":""},{"$f":"IF(X223=\"\",\"\",GETLONG(X223))","v":""},"","","","",null,"",null,"",null,"",{"$f":"IF(U223=\"\", O223, MAPSYMBOL(O223, U223, $O$8))","v":""},"",null,null,null,null,null,null,null,null,null,""]
[208,{"$f":"IF(W224=\"\",\"\",GETLat(W224))","v":""},{"$f":"IF(X224=\"\",\"\",GETLONG(X224))","v":""},"","","","",null,"",null,"",null,"",{"$f":"IF(U224=\"\", O224, MAPSYMBOL(O224, U224, $O$8))","v":""},"",null,null,null,null,null,null,null,null,null,""]
[209,{"$f":"IF(W225=\"\",\"\",GETLat(W225))","v":""},{"$f":"IF(X225=\"\",\"\",GETLONG(X225))","v":""},"","","","",null,"",null,"",null,"",{"$f":"IF(U225=\"\", O225, MAPSYMBOL(O225, U225, $O$8))","v":""},"",null,null,null,null,null,null,null,null,null,""]
[210,{"$f":"IF(W226=\"\",\"\",GETLat(W226))","v":""},{"$f":"IF(X226=\"\",\"\",GETLONG(X226))","v":""},"","","","",null,"",null,"",null,"",{"$f":"IF(U226=\"\", O226, MAPSYMBOL(O226, U226, $O$8))","v":""},"",null,null,null,null,null,null,null,null,null,""]
[211,{"$f":"IF(W227=\"\",\"\",GETLat(W227))","v":""},{"$f":"IF(X227=\"\",\"\",GETLONG(X227))","v":""},"","","","",null,"",null,"",null,"",{"$f":"IF(U227=\"\", O227, MAPSYMBOL(O227, U227, $O$8))","v":""},"",null,null,null,null,null,null,null,null,null,""]
[212,{"$f":"IF(W228=\"\",\"\",GETLat(W228))","v":""},{"$f":"IF(X228=\"\",\"\",GETLONG(X228))","v":""},"","","","",null,"",null,"",null,"",{"$f":"IF(U228=\"\", O228, MAPSYMBOL(O228, U228, $O$8))","v":""},"",null,null,null,null,null,null,null,null,null,""]
[213,{"$f":"IF(W229=\"\",\"\",GETLat(W229))","v":""},{"$f":"IF(X229=\"\",\"\",GETLONG(X229))","v":""},"","","","",null,"",null,"",null,"",{"$f":"IF(U229=\"\", O229, MAPSYMBOL(O229, U229, $O$8))","v":""},"",null,null,null,null,null,null,null,null,null,""]
[214,{"$f":"IF(W230=\"\",\"\",GETLat(W230))","v":""},{"$f":"IF(X230=\"\",\"\",GETLONG(X230))","v":""},"","","","",null,"",null,"",null,"",{"$f":"IF(U230=\"\", O230, MAPSYMBOL(O230, U230, $O$8))","v":""},"",null,null,null,null,null,null,null,null,null,""]
[215,{"$f":"IF(W231=\"\",\"\",GETLat(W231))","v":""},{"$f":"IF(X231=\"\",\"\",GETLONG(X231))","v":""},"","","","",null,"",null,"",null,"",{"$f":"IF(U231=\"\", O231, MAPSYMBOL(O231, U231, $O$8))","v":""},"",null,null,null,null,null,null,null,null,null,""]
[216,{"$f":"IF(W232=\"\",\"\",GETLat(W232))","v":""},{"$f":"IF(X232=\"\",\"\",GETLONG(X232))","v":""},"","","","",null,"",null,"",null,"",{"$f":"IF(U232=\"\", O232, MAPSYMBOL(O232, U232, $O$8))","v":""},"",null,null,null,null,null,null,null,null,null,""]
[217,{"$f":"IF(W233=\"\",\"\",GETLat(W233))","v":""},{"$f":"IF(X233=\"\",\"\",GETLONG(X233))","v":""},"","","","",null,"",null,"",null,"",{"$f":"IF(U233=\"\", O233, MAPSYMBOL(O233, U233, $O$8))","v":""},"",null,null,null,null,null,null,null,null,null,""]
[218,{"$f":"IF(W234=\"\",\"\",GETLat(W234))","v":""},{"$f":"IF(X234=\"\",\"\",GETLONG(X234))","v":""},"","","","",null,"",null,"",null,"",{"$f":"IF(U234=\"\", O234, MAPSYMBOL(O234, U234, $O$8))","v":""},"",null,null,null,null,null,null,null,null,null,""]
[219,{"$f":"IF(W235=\"\",\"\",GETLat(W235))","v":""},{"$f":"IF(X235=\"\",\"\",GETLONG(X235))","v":""},"","","","",null,"",null,"",null,"",{"$f":"IF(U235=\"\", O235, MAPSYMBOL(O235, U235, $O$8))","v":""},"",null,null,null,null,null,null,null,null,null,""]
[220,{"$f":"IF(W236=\"\",\"\",GETLat(W236))","v":""},{"$f":"IF(X236=\"\",\"\",GETLONG(X236))","v":""},"","","","",null,"",null,"",null,"",{"$f":"IF(U236=\"\", O236, MAPSYMBOL(O236, U236, $O$8))","v":""},"",null,null,null,null,null,null,null,null,null,""]
[221,{"$f":"IF(W237=\"\",\"\",GETLat(W237))","v":""},{"$f":"IF(X237=\"\",\"\",GETLONG(X237))","v":""},"","","","",null,"",null,"",null,"",{"$f":"IF(U237=\"\", O237, MAPSYMBOL(O237, U237, $O$8))","v":""},"",null,null,null,null,null,null,null,null,null,""]
[222,{"$f":"IF(W238=\"\",\"\",GETLat(W238))","v":""},{"$f":"IF(X238=\"\",\"\",GETLONG(X238))","v":""},"","","","",null,"",null,"",null,"",{"$f":"IF(U238=\"\", O238, MAPSYMBOL(O238, U238, $O$8))","v":""},"",null,null,null,null,null,null,null,null,null,""]
[223,{"$f":"IF(W239=\"\",\"\",GETLat(W239))","v":""},{"$f":"IF(X239=\"\",\"\",GETLONG(X239))","v":""},"","","","",null,"",null,"",null,"",{"$f":"IF(U239=\"\", O239, MAPSYMBOL(O239, U239, $O$8))","v":""},"",null,null,null,null,null,null,null,null,null,""]
[224,{"$f":"IF(W240=\"\",\"\",GETLat(W240))","v":""},{"$f":"IF(X240=\"\",\"\",GETLONG(X240))","v":""},"","","","",null,"",null,"",null,"",{"$f":"IF(U240=\"\", O240, MAPSYMBOL(O240, U240, $O$8))","v":""},"",null,null,null,null,null,null,null,null,null,""]
[225,{"$f":"IF(W241=\"\",\"\",GETLat(W241))","v":""},{"$f":"IF(X241=\"\",\"\",GETLONG(X241))","v":""},"","","","",null,"",null,"",null,"",{"$f":"IF(U241=\"\", O241, MAPSYMBOL(O241, U241, $O$8))","v":""},"",null,null,null,null,null,null,null,null,null,""]
[226,{"$f":"IF(W242=\"\",\"\",GETLat(W242))","v":""},{"$f":"IF(X242=\"\",\"\",GETLONG(X242))","v":""},"","","","",null,"",null,"",null,"",{"$f":"IF(U242=\"\", O242, MAPSYMBOL(O242, U242, $O$8))","v":""},"",null,null,null,null,null,null,null,null,null,""]
[227,{"$f":"IF(W243=\"\",\"\",GETLat(W243))","v":""},{"$f":"IF(X243=\"\",\"\",GETLONG(X243))","v":""},"","","","",null,"",null,"",null,"",{"$f":"IF(U243=\"\", O243, MAPSYMBOL(O243, U243, $O$8))","v":""},"",null,null,null,null,null,null,null,null,null,""]
[228,{"$f":"IF(W244=\"\",\"\",GETLat(W244))","v":""},{"$f":"IF(X244=\"\",\"\",GETLONG(X244))","v":""},"","","","",null,"",null,"",null,"",{"$f":"IF(U244=\"\", O244, MAPSYMBOL(O244, U244, $O$8))","v":""},"",null,null,null,null,null,null,null,null,null,""]
[229,{"$f":"IF(W245=\"\",\"\",GETLat(W245))","v":""},{"$f":"IF(X245=\"\",\"\",GETLONG(X245))","v":""},"","","","",null,"",null,"",null,"",{"$f":"IF(U245=\"\", O245, MAPSYMBOL(O245, U245, $O$8))","v":""},"",null,null,null,null,null,null,null,null,null,""]
[230,{"$f":"IF(W246=\"\",\"\",GETLat(W246))","v":""},{"$f":"IF(X246=\"\",\"\",GETLONG(X246))","v":""},"","","","",null,"",null,"",null,"",{"$f":"IF(U246=\"\", O246, MAPSYMBOL(O246, U246, $O$8))","v":""},"",null,null,null,null,null,null,null,null,null,""]
[231,{"$f":"IF(W247=\"\",\"\",GETLat(W247))","v":""},{"$f":"IF(X247=\"\",\"\",GETLONG(X247))","v":""},"","","","",null,"",null,"",null,"",{"$f":"IF(U247=\"\", O247, MAPSYMBOL(O247, U247, $O$8))","v":""},"",null,null,null,null,null,null,null,null,null,""]
[232,{"$f":"IF(W248=\"\",\"\",GETLat(W248))","v":""},{"$f":"IF(X248=\"\",\"\",GETLONG(X248))","v":""},"","","","",null,"",null,"",null,"",{"$f":"IF(U248=\"\", O248, MAPSYMBOL(O248, U248, $O$8))","v":""},"",null,null,null,null,null,null,null,null,null,""]
[233,{"$f":"IF(W249=\"\",\"\",GETLat(W249))","v":""},{"$f":"IF(X249=\"\",\"\",GETLONG(X249))","v":""},"","","","",null,"",null,"",null,"",{"$f":"IF(U249=\"\", O249, MAPSYMBOL(O249, U249, $O$8))","v":""},"",null,null,null,null,null,null,null,null,null,""]
[234,{"$f":"IF(W250=\"\",\"\",GETLat(W250))","v":""},{"$f":"IF(X250=\"\",\"\",GETLONG(X250))","v":""},"","","","",null,"",null,"",null,"",{"$f":"IF(U250=\"\", O250, MAPSYMBOL(O250, U250, $O$8))","v":""},"",null,null,null,null,null,null,null,null,null,""]
[235,{"$f":"IF(W251=\"\",\"\",GETLat(W251))","v":""},{"$f":"IF(X251=\"\",\"\",GETLONG(X251))","v":""},"","","","",null,"",null,"",null,"",{"$f":"IF(U251=\"\", O251, MAPSYMBOL(O251, U251, $O$8))","v":""},"",null,null,null,null,null,null,null,null,null,""]
[236,{"$f":"IF(W252=\"\",\"\",GETLat(W252))","v":""},{"$f":"IF(X252=\"\",\"\",GETLONG(X252))","v":""},"","","","",null,"",null,"",null,"",{"$f":"IF(U252=\"\", O252, MAPSYMBOL(O252, U252, $O$8))","v":""},"",null,null,null,null,null,null,null,null,null,""]
[237,{"$f":"IF(W253=\"\",\"\",GETLat(W253))","v":""},{"$f":"IF(X253=\"\",\"\",GETLONG(X253))","v":""},"","","","",null,"",null,"",null,"",{"$f":"IF(U253=\"\", O253, MAPSYMBOL(O253, U253, $O$8))","v":""},"",null,null,null,null,null,null,null,null,null,""]
[238,{"$f":"IF(W254=\"\",\"\",GETLat(W254))","v":""},{"$f":"IF(X254=\"\",\"\",GETLONG(X254))","v":""},"","","","",null,"",null,"",null,"",{"$f":"IF(U254=\"\", O254, MAPSYMBOL(O254, U254, $O$8))","v":""},"",null,null,null,null,null,null,null,null,null,""]
[239,{"$f":"IF(W255=\"\",\"\",GETLat(W255))","v":""},{"$f":"IF(X255=\"\",\"\",GETLONG(X255))","v":""},"","","","",null,"",null,"",null,"",{"$f":"IF(U255=\"\", O255, MAPSYMBOL(O255, U255, $O$8))","v":""},"",null,null,null,null,null,null,null,null,null,""]
[240,{"$f":"IF(W256=\"\",\"\",GETLat(W256))","v":""},{"$f":"IF(X256=\"\",\"\",GETLONG(X256))","v":""},"","","","",null,"",null,"",null,"",{"$f":"IF(U256=\"\", O256, MAPSYMBOL(O256, U256, $O$8))","v":""},"",null,null,null,null,null,null,null,null,null,""]
[241,{"$f":"IF(W257=\"\",\"\",GETLat(W257))","v":""},{"$f":"IF(X257=\"\",\"\",GETLONG(X257))","v":""},"","","","",null,"",null,"",null,"",{"$f":"IF(U257=\"\", O257, MAPSYMBOL(O257, U257, $O$8))","v":""},"",null,null,null,null,null,null,null,null,null,""]
[242,{"$f":"IF(W258=\"\",\"\",GETLat(W258))","v":""},{"$f":"IF(X258=\"\",\"\",GETLONG(X258))","v":""},"","","","",null,"",null,"",null,"",{"$f":"IF(U258=\"\", O258, MAPSYMBOL(O258, U258, $O$8))","v":""},"",null,null,null,null,null,null,null,null,null,""]
[243,{"$f":"IF(W259=\"\",\"\",GETLat(W259))","v":""},{"$f":"IF(X259=\"\",\"\",GETLONG(X259))","v":""},"","","","",null,"",null,"",null,"",{"$f":"IF(U259=\"\", O259, MAPSYMBOL(O259, U259, $O$8))","v":""},"",null,null,null,null,null,null,null,null,null,""]
[244,{"$f":"IF(W260=\"\",\"\",GETLat(W260))","v":""},{"$f":"IF(X260=\"\",\"\",GETLONG(X260))","v":""},"","","","",null,"",null,"",null,"",{"$f":"IF(U260=\"\", O260, MAPSYMBOL(O260, U260, $O$8))","v":""},"",null,null,null,null,null,null,null,null,null,""]
[245,{"$f":"IF(W261=\"\",\"\",GETLat(W261))","v":""},{"$f":"IF(X261=\"\",\"\",GETLONG(X261))","v":""},"","","","",null,"",null,"",null,"",{"$f":"IF(U261=\"\", O261, MAPSYMBOL(O261, U261, $O$8))","v":""},"",null,null,null,null,null,null,null,null,null,""]
[246,{"$f":"IF(W262=\"\",\"\",GETLat(W262))","v":""},{"$f":"IF(X262=\"\",\"\",GETLONG(X262))","v":""},"","","","",null,"",null,"",null,"",{"$f":"IF(U262=\"\", O262, MAPSYMBOL(O262, U262, $O$8))","v":""},"",null,null,null,null,null,null,null,null,null,""]
[247,{"$f":"IF(W263=\"\",\"\",GETLat(W263))","v":""},{"$f":"IF(X263=\"\",\"\",GETLONG(X263))","v":""},"","","","",null,"",null,"",null,"",{"$f":"IF(U263=\"\", O263, MAPSYMBOL(O263, U263, $O$8))","v":""},"",null,null,null,null,null,null,null,null,null,""]
[248,{"$f":"IF(W264=\"\",\"\",GETLat(W264))","v":""},{"$f":"IF(X264=\"\",\"\",GETLONG(X264))","v":""},"","","","",null,"",null,"",null,"",{"$f":"IF(U264=\"\", O264, MAPSYMBOL(O264, U264, $O$8))","v":""},"",null,null,null,null,null,null,null,null,null,""]
[249,{"$f":"IF(W265=\"\",\"\",GETLat(W265))","v":""},{"$f":"IF(X265=\"\",\"\",GETLONG(X265))","v":""},"","","","",null,"",null,"",null,"",{"$f":"IF(U265=\"\", O265, MAPSYMBOL(O265, U265, $O$8))","v":""},"",null,null,null,null,null,null,null,null,null,""]
[250,{"$f":"IF(W266=\"\",\"\",GETLat(W266))","v":""},{"$f":"IF(X266=\"\",\"\",GETLONG(X266))","v":""},"","","","",null,"",null,"",null,"",{"$f":"IF(U266=\"\", O266, MAPSYMBOL(O266, U266, $O$8))","v":""},"",null,null,null,null,null,null,null,null,null,""]
[251,{"$f":"IF(W267=\"\",\"\",GETLat(W267))","v":""},{"$f":"IF(X267=\"\",\"\",GETLONG(X267))","v":""},"","","","",null,"",null,"",null,"",{"$f":"IF(U267=\"\", O267, MAPSYMBOL(O267, U267, $O$8))","v":""},"",null,null,null,null,null,null,null,null,null,""]
[252,{"$f":"IF(W268=\"\",\"\",GETLat(W268))","v":""},{"$f":"IF(X268=\"\",\"\",GETLONG(X268))","v":""},"","","","",null,"",null,"",null,"",{"$f":"IF(U268=\"\", O268, MAPSYMBOL(O268, U268, $O$8))","v":""},"",null,null,null,null,null,null,null,null,null,""]
[253,{"$f":"IF(W269=\"\",\"\",GETLat(W269))","v":""},{"$f":"IF(X269=\"\",\"\",GETLONG(X269))","v":""},"","","","",null,"",null,"",null,"",{"$f":"IF(U269=\"\", O269, MAPSYMBOL(O269, U269, $O$8))","v":""},"",null,null,null,null,null,null,null,null,null,""]
[254,{"$f":"IF(W270=\"\",\"\",GETLat(W270))","v":""},{"$f":"IF(X270=\"\",\"\",GETLONG(X270))","v":""},"","","","",null,"",null,"",null,"",{"$f":"IF(U270=\"\", O270, MAPSYMBOL(O270, U270, $O$8))","v":""},"",null,null,null,null,null,null,null,null,null,""]
[255,{"$f":"IF(W271=\"\",\"\",GETLat(W271))","v":""},{"$f":"IF(X271=\"\",\"\",GETLONG(X271))","v":""},"","","","",null,"",null,"",null,"",{"$f":"IF(U271=\"\", O271, MAPSYMBOL(O271, U271, $O$8))","v":""},"",null,null,null,null,null,null,null,null,null,""]
[256,{"$f":"IF(W272=\"\",\"\",GETLat(W272))","v":""},{"$f":"IF(X272=\"\",\"\",GETLONG(X272))","v":""},"","","","",null,"",null,"",null,"",{"$f":"IF(U272=\"\", O272, MAPSYMBOL(O272, U272, $O$8))","v":""},"",null,null,null,null,null,null,null,null,null,""]
[257,{"$f":"IF(W273=\"\",\"\",GETLat(W273))","v":""},{"$f":"IF(X273=\"\",\"\",GETLONG(X273))","v":""},{"$f":"NamePlus($O$7, S273, T273, U273, V273)","v":""},{"$f":"IF(V273=\"\",\"\",V273)","v":""},{"$f":"IF(T273=\"\",\"\",IF($F$9 = TRUE,T273,\"\"))","v":""},{"$f":"N273","v":""},null,{"$f":"IF(S273=\"\",\"\",S273)","v":""},null,{"$f":"IF(J273<>\"\",T273,\"\")","v":""},null,{"$f":"IF(T273=\"\",\"\",T273)","v":""},{"$f":"IF(U273=\"\", O273, MAPSYMBOL(O273, U273, $O$8))","v":""},{"$f":"IF(OR(W273=\"\",X273=\"\"),\"\",VLOOKUP(T273,$M$4:$N$12,2,TRUE))","v":""},null,null,null,null,null,null,null,null,null,""]
[258,{"$f":"IF(W274=\"\",\"\",GETLat(W274))","v":""},{"$f":"IF(X274=\"\",\"\",GETLONG(X274))","v":""},"","","","",null,"",null,"",null,"",{"$f":"IF(U274=\"\", O274, MAPSYMBOL(O274, U274, $O$8))","v":""},"",null,null,null,null,null,null,null,null,null,{"$f":"IF(OR(W274=\"\",X274=\"\"),\"\",HYPERLINK(\"https://maps.google.com/maps?q=\"&B274&\",\"&C274))","v":""}]
[259,{"$f":"IF(W275=\"\",\"\",GETLat(W275))","v":""},{"$f":"IF(X275=\"\",\"\",GETLONG(X275))","v":""},"","","","",null,"",null,"",null,"",{"$f":"IF(U275=\"\", O275, MAPSYMBOL(O275, U275, $O$8))","v":""},"",null,null,null,null,null,null,null,null,null,""]
[260,{"$f":"IF(W276=\"\",\"\",GETLat(W276))","v":""},{"$f":"IF(X276=\"\",\"\",GETLONG(X276))","v":""},"","","","",null,"",null,"",null,"",{"$f":"IF(U276=\"\", O276, MAPSYMBOL(O276, U276, $O$8))","v":""},"",null,null,null,null,null,null,null,null,null,""]
[261,{"$f":"IF(W277=\"\",\"\",GETLat(W277))","v":""},{"$f":"IF(X277=\"\",\"\",GETLONG(X277))","v":""},"","","","",null,"",null,"",null,"",{"$f":"IF(U277=\"\", O277, MAPSYMBOL(O277, U277, $O$8))","v":""},"",null,null,null,null,null,null,null,null,null,""]
[262,{"$f":"IF(W278=\"\",\"\",GETLat(W278))","v":""},{"$f":"IF(X278=\"\",\"\",GETLONG(X278))","v":""},"","","","",null,"",null,"",null,"",{"$f":"IF(U278=\"\", O278, MAPSYMBOL(O278, U278, $O$8))","v":""},"",null,null,null,null,null,null,null,null,null,""]
[263,{"$f":"IF(W279=\"\",\"\",GETLat(W279))","v":""},{"$f":"IF(X279=\"\",\"\",GETLONG(X279))","v":""},"","","","",null,"",null,"",null,"",{"$f":"IF(U279=\"\", O279, MAPSYMBOL(O279, U279, $O$8))","v":""},"",null,null,null,null,null,null,null,null,null,""]
[264,{"$f":"IF(W280=\"\",\"\",GETLat(W280))","v":""},{"$f":"IF(X280=\"\",\"\",GETLONG(X280))","v":""},"","","","",null,"",null,"",null,"",{"$f":"IF(U280=\"\", O280, MAPSYMBOL(O280, U280, $O$8))","v":""},"",null,null,null,null,null,null,null,null,null,""]
[265,{"$f":"IF(W281=\"\",\"\",GETLat(W281))","v":""},{"$f":"IF(X281=\"\",\"\",GETLONG(X281))","v":""},"","","","",null,"",null,"",null,"",{"$f":"IF(U281=\"\", O281, MAPSYMBOL(O281, U281, $O$8))","v":""},"",null,null,null,null,null,null,null,null,null,""]
[266,{"$f":"IF(W282=\"\",\"\",GETLat(W282))","v":""},{"$f":"IF(X282=\"\",\"\",GETLONG(X282))","v":""},"","","","",null,"",null,"",null,"",{"$f":"IF(U282=\"\", O282, MAPSYMBOL(O282, U282, $O$8))","v":""},"",null,null,null,null,null,null,null,null,null,""]
[267,{"$f":"IF(W283=\"\",\"\",GETLat(W283))","v":""},{"$f":"IF(X283=\"\",\"\",GETLONG(X283))","v":""},"","","","",null,"",null,"",null,"",{"$f":"IF(U283=\"\", O283, MAPSYMBOL(O283, U283, $O$8))","v":""},"",null,null,null,null,null,null,null,null,null,""]
[268,{"$f":"IF(W284=\"\",\"\",GETLat(W284))","v":""},{"$f":"IF(X284=\"\",\"\",GETLONG(X284))","v":""},"","","","",null,"",null,"",null,"",{"$f":"IF(U284=\"\", O284, MAPSYMBOL(O284, U284, $O$8))","v":""},"",null,null,null,null,null,null,null,null,null,""]
[269,{"$f":"IF(W285=\"\",\"\",GETLat(W285))","v":""},{"$f":"IF(X285=\"\",\"\",GETLONG(X285))","v":""},"","","","",null,"",null,"",null,"",{"$f":"IF(U285=\"\", O285, MAPSYMBOL(O285, U285, $O$8))","v":""},"",null,null,null,null,null,null,null,null,null,""]
[270,{"$f":"IF(W286=\"\",\"\",GETLat(W286))","v":""},{"$f":"IF(X286=\"\",\"\",GETLONG(X286))","v":""},"","","","",null,"",null,"",null,"",{"$f":"IF(U286=\"\", O286, MAPSYMBOL(O286, U286, $O$8))","v":""},"",null,null,null,null,null,null,null,null,null,""]
[271,{"$f":"IF(W287=\"\",\"\",GETLat(W287))","v":""},{"$f":"IF(X287=\"\",\"\",GETLONG(X287))","v":""},"","","","",null,"",null,"",null,"",{"$f":"IF(U287=\"\", O287, MAPSYMBOL(O287, U287, $O$8))","v":""},"",null,null,null,null,null,null,null,null,null,""]
[272,{"$f":"IF(W288=\"\",\"\",GETLat(W288))","v":""},{"$f":"IF(X288=\"\",\"\",GETLONG(X288))","v":""},"","","","",null,"",null,"",null,"",{"$f":"IF(U288=\"\", O288, MAPSYMBOL(O288, U288, $O$8))","v":""},"",null,null,null,null,null,null,null,null,null,""]
[273,{"$f":"IF(W289=\"\",\"\",GETLat(W289))","v":""},{"$f":"IF(X289=\"\",\"\",GETLONG(X289))","v":""},"","","","",null,"",null,"",null,"",{"$f":"IF(U289=\"\", O289, MAPSYMBOL(O289, U289, $O$8))","v":""},"",null,null,null,null,null,null,null,null,null,""]
[274,{"$f":"IF(W290=\"\",\"\",GETLat(W290))","v":""},{"$f":"IF(X290=\"\",\"\",GETLONG(X290))","v":""},"","","","",null,"",null,"",null,"",{"$f":"IF(U290=\"\", O290, MAPSYMBOL(O290, U290, $O$8))","v":""},"",null,null,null,null,null,null,null,null,null,""]
[275,{"$f":"IF(W291=\"\",\"\",GETLat(W291))","v":""},{"$f":"IF(X291=\"\",\"\",GETLONG(X291))","v":""},"","","","",null,"",null,"",null,"",{"$f":"IF(U291=\"\", O291, MAPSYMBOL(O291, U291, $O$8))","v":""},"",null,null,null,null,null,null,null,null,null,""]
[276,{"$f":"IF(W292=\"\",\"\",GETLat(W292))","v":""},{"$f":"IF(X292=\"\",\"\",GETLONG(X292))","v":""},"","","","",null,"",null,"",null,"",{"$f":"IF(U292=\"\", O292, MAPSYMBOL(O292, U292, $O$8))","v":""},"",null,null,null,null,null,null,null,null,null,""]
[277,{"$f":"IF(W293=\"\",\"\",GETLat(W293))","v":""},{"$f":"IF(X293=\"\",\"\",GETLONG(X293))","v":""},"","","","",null,"",null,"",null,"",{"$f":"IF(U293=\"\", O293, MAPSYMBOL(O293, U293, $O$8))","v":""},"",null,null,null,null,null,null,null,null,null,""]
[278,{"$f":"IF(W294=\"\",\"\",GETLat(W294))","v":""},{"$f":"IF(X294=\"\",\"\",GETLONG(X294))","v":""},"","","","",null,"",null,"",null,"",{"$f":"IF(U294=\"\", O294, MAPSYMBOL(O294, U294, $O$8))","v":""},"",null,null,null,null,null,null,null,null,null,""]
[279,{"$f":"IF(W295=\"\",\"\",GETLat(W295))","v":""},{"$f":"IF(X295=\"\",\"\",GETLONG(X295))","v":""},"","","","",null,"",null,"",null,"",{"$f":"IF(U295=\"\", O295, MAPSYMBOL(O295, U295, $O$8))","v":""},"",null,null,null,null,null,null,null,null,null,""]
[280,{"$f":"IF(W296=\"\",\"\",GETLat(W296))","v":""},{"$f":"IF(X296=\"\",\"\",GETLONG(X296))","v":""},"","","","",null,"",null,"",null,"",{"$f":"IF(U296=\"\", O296, MAPSYMBOL(O296, U296, $O$8))","v":""},"",null,null,null,null,null,null,null,null,null,""]
[281,{"$f":"IF(W297=\"\",\"\",GETLat(W297))","v":""},{"$f":"IF(X297=\"\",\"\",GETLONG(X297))","v":""},"","","","",null,"",null,"",null,"",{"$f":"IF(U297=\"\", O297, MAPSYMBOL(O297, U297, $O$8))","v":""},"",null,null,null,null,null,null,null,null,null,""]
[282,{"$f":"IF(W298=\"\",\"\",GETLat(W298))","v":""},{"$f":"IF(X298=\"\",\"\",GETLONG(X298))","v":""},"","","","",null,"",null,"",null,"",{"$f":"IF(U298=\"\", O298, MAPSYMBOL(O298, U298, $O$8))","v":""},"",null,null,null,null,null,null,null,null,null,""]
[283,{"$f":"IF(W299=\"\",\"\",GETLat(W299))","v":""},{"$f":"IF(X299=\"\",\"\",GETLONG(X299))","v":""},"","","","",null,"",null,"",null,"",{"$f":"IF(U299=\"\", O299, MAPSYMBOL(O299, U299, $O$8))","v":""},"",null,null,null,null,null,null,null,null,null,""]
[284,{"$f":"IF(W300=\"\",\"\",GETLat(W300))","v":""},{"$f":"IF(X300=\"\",\"\",GETLONG(X300))","v":""},"","","","",null,"",null,"",null,"",{"$f":"IF(U300=\"\", O300, MAPSYMBOL(O300, U300, $O$8))","v":""},"",null,null,null,null,null,null,null,null,null,""]
[285,{"$f":"IF(W301=\"\",\"\",GETLat(W301))","v":""},{"$f":"IF(X301=\"\",\"\",GETLONG(X301))","v":""},"","","","",null,"",null,"",null,"",{"$f":"IF(U301=\"\", O301, MAPSYMBOL(O301, U301, $O$8))","v":""},"",null,null,null,null,null,null,null,null,null,""]
[286,{"$f":"IF(W302=\"\",\"\",GETLat(W302))","v":""},{"$f":"IF(X302=\"\",\"\",GETLONG(X302))","v":""},"","","","",null,"",null,"",null,"",{"$f":"IF(U302=\"\", O302, MAPSYMBOL(O302, U302, $O$8))","v":""},"",null,null,null,null,null,null,null,null,null,""]
[287,{"$f":"IF(W303=\"\",\"\",GETLat(W303))","v":""},{"$f":"IF(X303=\"\",\"\",GETLONG(X303))","v":""},"","","","",null,"",null,"",null,"",{"$f":"IF(U303=\"\", O303, MAPSYMBOL(O303, U303, $O$8))","v":""},"",null,null,null,null,null,null,null,null,null,""]
[288,{"$f":"IF(W304=\"\",\"\",GETLat(W304))","v":""},{"$f":"IF(X304=\"\",\"\",GETLONG(X304))","v":""},"","","","",null,"",null,"",null,"",{"$f":"IF(U304=\"\", O304, MAPSYMBOL(O304, U304, $O$8))","v":""},"",null,null,null,null,null,null,null,null,null,""]
[289,{"$f":"IF(W305=\"\",\"\",GETLat(W305))","v":""},{"$f":"IF(X305=\"\",\"\",GETLONG(X305))","v":""},"","","","",null,"",null,"",null,"",{"$f":"IF(U305=\"\", O305, MAPSYMBOL(O305, U305, $O$8))","v":""},"",null,null,null,null,null,null,null,null,null,""]
[290,{"$f":"IF(W306=\"\",\"\",GETLat(W306))","v":""},{"$f":"IF(X306=\"\",\"\",GETLONG(X306))","v":""},"","","","",null,"",null,"",null,"",{"$f":"IF(U306=\"\", O306, MAPSYMBOL(O306, U306, $O$8))","v":""},"",null,null,null,null,null,null,null,null,null,""]
[291,{"$f":"IF(W307=\"\",\"\",GETLat(W307))","v":""},{"$f":"IF(X307=\"\",\"\",GETLONG(X307))","v":""},"","","","",null,"",null,"",null,"",{"$f":"IF(U307=\"\", O307, MAPSYMBOL(O307, U307, $O$8))","v":""},"",null,null,null,null,null,null,null,null,null,""]
[292,{"$f":"IF(W308=\"\",\"\",GETLat(W308))","v":""},{"$f":"IF(X308=\"\",\"\",GETLONG(X308))","v":""},"","","","",null,"",null,"",null,"",{"$f":"IF(U308=\"\", O308, MAPSYMBOL(O308, U308, $O$8))","v":""},"",null,null,null,null,null,null,null,null,null,""]
[293,{"$f":"IF(W309=\"\",\"\",GETLat(W309))","v":""},{"$f":"IF(X309=\"\",\"\",GETLONG(X309))","v":""},"","","","",null,"",null,"",null,"",{"$f":"IF(U309=\"\", O309, MAPSYMBOL(O309, U309, $O$8))","v":""},"",null,null,null,null,null,null,null,null,null,""]
[294,{"$f":"IF(W310=\"\",\"\",GETLat(W310))","v":""},{"$f":"IF(X310=\"\",\"\",GETLONG(X310))","v":""},"","","","",null,"",null,"",null,"",{"$f":"IF(U310=\"\", O310, MAPSYMBOL(O310, U310, $O$8))","v":""},"",null,null,null,null,null,null,null,null,null,""]
[295,{"$f":"IF(W311=\"\",\"\",GETLat(W311))","v":""},{"$f":"IF(X311=\"\",\"\",GETLONG(X311))","v":""},"","","","",null,"",null,"",null,"",{"$f":"IF(U311=\"\", O311, MAPSYMBOL(O311, U311, $O$8))","v":""},"",null,null,null,null,null,null,null,null,null,""]
[296,{"$f":"IF(W312=\"\",\"\",GETLat(W312))","v":""},{"$f":"IF(X312=\"\",\"\",GETLONG(X312))","v":""},"","","","",null,"",null,"",null,"",{"$f":"IF(U312=\"\", O312, MAPSYMBOL(O312, U312, $O$8))","v":""},"",null,null,null,null,null,null,null,null,null,""]
[297,{"$f":"IF(W313=\"\",\"\",GETLat(W313))","v":""},{"$f":"IF(X313=\"\",\"\",GETLONG(X313))","v":""},"","","","",null,"",null,"",null,"",{"$f":"IF(U313=\"\", O313, MAPSYMBOL(O313, U313, $O$8))","v":""},"",null,null,null,null,null,null,null,null,null,""]
[298,{"$f":"IF(W314=\"\",\"\",GETLat(W314))","v":""},{"$f":"IF(X314=\"\",\"\",GETLONG(X314))","v":""},"","","","",null,"",null,"",null,"",{"$f":"IF(U314=\"\", O314, MAPSYMBOL(O314, U314, $O$8))","v":""},"",null,null,null,null,null,null,null,null,null,""]
[299,{"$f":"IF(W315=\"\",\"\",GETLat(W315))","v":""},{"$f":"IF(X315=\"\",\"\",GETLONG(X315))","v":""},"","","","",null,"",null,"",null,"",{"$f":"IF(U315=\"\", O315, MAPSYMBOL(O315, U315, $O$8))","v":""},"",null,null,null,null,null,null,null,null,null,""]
[300,{"$f":"IF(W316=\"\",\"\",GETLat(W316))","v":""},{"$f":"IF(X316=\"\",\"\",GETLONG(X316))","v":""},"","","","",null,"",null,"",null,"",{"$f":"IF(U316=\"\", O316, MAPSYMBOL(O316, U316, $O$8))","v":""},"",null,null,null,null,null,null,null,null,null,""]
[301,{"$f":"IF(W317=\"\",\"\",GETLat(W317))","v":""},{"$f":"IF(X317=\"\",\"\",GETLONG(X317))","v":""},"","","","",null,"",null,"",null,"",{"$f":"IF(U317=\"\", O317, MAPSYMBOL(O317, U317, $O$8))","v":""},"",null,null,null,null,null,null,null,null,null,""]
[302,{"$f":"IF(W318=\"\",\"\",GETLat(W318))","v":""},{"$f":"IF(X318=\"\",\"\",GETLONG(X318))","v":""},"","","","",null,"",null,"",null,"",{"$f":"IF(U318=\"\", O318, MAPSYMBOL(O318, U318, $O$8))","v":""},"",null,null,null,null,null,null,null,null,null,""]
[303,{"$f":"IF(W319=\"\",\"\",GETLat(W319))","v":""},{"$f":"IF(X319=\"\",\"\",GETLONG(X319))","v":""},"","","","",null,"",null,"",null,"",{"$f":"IF(U319=\"\", O319, MAPSYMBOL(O319, U319, $O$8))","v":""},"",null,null,null,null,null,null,null,null,null,""]
[304,{"$f":"IF(W320=\"\",\"\",GETLat(W320))","v":""},{"$f":"IF(X320=\"\",\"\",GETLONG(X320))","v":""},"","","","",null,"",null,"",null,"",{"$f":"IF(U320=\"\", O320, MAPSYMBOL(O320, U320, $O$8))","v":""},"",null,null,null,null,null,null,null,null,null,""]
[305,{"$f":"IF(W321=\"\",\"\",GETLat(W321))","v":""},{"$f":"IF(X321=\"\",\"\",GETLONG(X321))","v":""},"","","","",null,"",null,"",null,"",{"$f":"IF(U321=\"\", O321, MAPSYMBOL(O321, U321, $O$8))","v":""},"",null,null,null,null,null,null,null,null,null,""]
[306,{"$f":"IF(W322=\"\",\"\",GETLat(W322))","v":""},{"$f":"IF(X322=\"\",\"\",GETLONG(X322))","v":""},"","","","",null,"",null,"",null,"",{"$f":"IF(U322=\"\", O322, MAPSYMBOL(O322, U322, $O$8))","v":""},"",null,null,null,null,null,null,null,null,null,""]
[307,{"$f":"IF(W323=\"\",\"\",GETLat(W323))","v":""},{"$f":"IF(X323=\"\",\"\",GETLONG(X323))","v":""},"","","","",null,"",null,"",null,"",{"$f":"IF(U323=\"\", O323, MAPSYMBOL(O323, U323, $O$8))","v":""},"",null,null,null,null,null,null,null,null,null,""]
[308,{"$f":"IF(W324=\"\",\"\",GETLat(W324))","v":""},{"$f":"IF(X324=\"\",\"\",GETLONG(X324))","v":""},"","","","",null,"",null,"",null,"",{"$f":"IF(U324=\"\", O324, MAPSYMBOL(O324, U324, $O$8))","v":""},"",null,null,null,null,null,null,null,null,null,""]
[309,{"$f":"IF(W325=\"\",\"\",GETLat(W325))","v":""},{"$f":"IF(X325=\"\",\"\",GETLONG(X325))","v":""},"","","","",null,"",null,"",null,"",{"$f":"IF(U325=\"\", O325, MAPSYMBOL(O325, U325, $O$8))","v":""},"",null,null,null,null,null,null,null,null,null,""]
[310,{"$f":"IF(W326=\"\",\"\",GETLat(W326))","v":""},{"$f":"IF(X326=\"\",\"\",GETLONG(X326))","v":""},"","","","",null,"",null,"",null,"",{"$f":"IF(U326=\"\", O326, MAPSYMBOL(O326, U326, $O$8))","v":""},"",null,null,null,null,null,null,null,null,null,""]
[311,{"$f":"IF(W327=\"\",\"\",GETLat(W327))","v":""},{"$f":"IF(X327=\"\",\"\",GETLONG(X327))","v":""},"","","","",null,"",null,"",null,"",{"$f":"IF(U327=\"\", O327, MAPSYMBOL(O327, U327, $O$8))","v":""},"",null,null,null,null,null,null,null,null,null,""]
[312,{"$f":"IF(W328=\"\",\"\",GETLat(W328))","v":""},{"$f":"IF(X328=\"\",\"\",GETLONG(X328))","v":""},"","","","",null,"",null,"",null,"",{"$f":"IF(U328=\"\", O328, MAPSYMBOL(O328, U328, $O$8))","v":""},"",null,null,null,null,null,null,null,null,null,""]
[313,{"$f":"IF(W329=\"\",\"\",GETLat(W329))","v":""},{"$f":"IF(X329=\"\",\"\",GETLONG(X329))","v":""},"","","","",null,"",null,"",null,"",{"$f":"IF(U329=\"\", O329, MAPSYMBOL(O329, U329, $O$8))","v":""},"",null,null,null,null,null,null,null,null,null,""]
[314,{"$f":"IF(W330=\"\",\"\",GETLat(W330))","v":""},{"$f":"IF(X330=\"\",\"\",GETLONG(X330))","v":""},"","","","",null,"",null,"",null,"",{"$f":"IF(U330=\"\", O330, MAPSYMBOL(O330, U330, $O$8))","v":""},"",null,null,null,null,null,null,null,null,null,""]
[315,{"$f":"IF(W331=\"\",\"\",GETLat(W331))","v":""},{"$f":"IF(X331=\"\",\"\",GETLONG(X331))","v":""},"","","","",null,"",null,"",null,"",{"$f":"IF(U331=\"\", O331, MAPSYMBOL(O331, U331, $O$8))","v":""},"",null,null,null,null,null,null,null,null,null,""]
[316,{"$f":"IF(W332=\"\",\"\",GETLat(W332))","v":""},{"$f":"IF(X332=\"\",\"\",GETLONG(X332))","v":""},"","","","",null,"",null,"",null,"",{"$f":"IF(U332=\"\", O332, MAPSYMBOL(O332, U332, $O$8))","v":""},"",null,null,null,null,null,null,null,null,null,""]
[317,{"$f":"IF(W333=\"\",\"\",GETLat(W333))","v":""},{"$f":"IF(X333=\"\",\"\",GETLONG(X333))","v":""},"","","","",null,"",null,"",null,"",{"$f":"IF(U333=\"\", O333, MAPSYMBOL(O333, U333, $O$8))","v":""},"",null,null,null,null,null,null,null,null,null,""]
[318,{"$f":"IF(W334=\"\",\"\",GETLat(W334))","v":""},{"$f":"IF(X334=\"\",\"\",GETLONG(X334))","v":""},"","","","",null,"",null,"",null,"",{"$f":"IF(U334=\"\", O334, MAPSYMBOL(O334, U334, $O$8))","v":""},"",null,null,null,null,null,null,null,null,null,""]
[319,{"$f":"IF(W335=\"\",\"\",GETLat(W335))","v":""},{"$f":"IF(X335=\"\",\"\",GETLONG(X335))","v":""},"","","","",null,"",null,"",null,"",{"$f":"IF(U335=\"\", O335, MAPSYMBOL(O335, U335, $O$8))","v":""},"",null,null,null,null,null,null,null,null,null,""]
[320,{"$f":"IF(W336=\"\",\"\",GETLat(W336))","v":""},{"$f":"IF(X336=\"\",\"\",GETLONG(X336))","v":""},"","","","",null,"",null,"",null,"",{"$f":"IF(U336=\"\", O336, MAPSYMBOL(O336, U336, $O$8))","v":""},"",null,null,null,null,null,null,null,null,null,""]
[321,{"$f":"IF(W337=\"\",\"\",GETLat(W337))","v":""},{"$f":"IF(X337=\"\",\"\",GETLONG(X337))","v":""},{"$f":"NamePlus($O$7, S337, T337, U337, V337)","v":""},{"$f":"IF(V337=\"\",\"\",V337)","v":""},{"$f":"IF(T337=\"\",\"\",IF($F$9 = TRUE,T337,\"\"))","v":""},{"$f":"N337","v":""},null,{"$f":"IF(S337=\"\",\"\",S337)","v":""},null,{"$f":"IF(J337<>\"\",T337,\"\")","v":""},null,{"$f":"IF(T337=\"\",\"\",T337)","v":""},{"$f":"IF(U337=\"\", O337, MAPSYMBOL(O337, U337, $O$8))","v":""},{"$f":"IF(OR(W337=\"\",X337=\"\"),\"\",VLOOKUP(T337,$M$4:$N$12,2,TRUE))","v":""},null,null,null,null,null,null,null,null,null,""]
[322,{"$f":"IF(W338=\"\",\"\",GETLat(W338))","v":""},{"$f":"IF(X338=\"\",\"\",GETLONG(X338))","v":""},"","","","",null,"",null,"",null,"",{"$f":"IF(U338=\"\", O338, MAPSYMBOL(O338, U338, $O$8))","v":""},"",null,null,null,null,null,null,null,null,null,{"$f":"IF(OR(W338=\"\",X338=\"\"),\"\",HYPERLINK(\"https://maps.google.com/maps?q=\"&B338&\",\"&C338))","v":""}]
[323,{"$f":"IF(W339=\"\",\"\",GETLat(W339))","v":""},{"$f":"IF(X339=\"\",\"\",GETLONG(X339))","v":""},"","","","",null,"",null,"",null,"",{"$f":"IF(U339=\"\", O339, MAPSYMBOL(O339, U339, $O$8))","v":""},"",null,null,null,null,null,null,null,null,null,""]
[324,{"$f":"IF(W340=\"\",\"\",GETLat(W340))","v":""},{"$f":"IF(X340=\"\",\"\",GETLONG(X340))","v":""},"","","","",null,"",null,"",null,"",{"$f":"IF(U340=\"\", O340, MAPSYMBOL(O340, U340, $O$8))","v":""},"",null,null,null,null,null,null,null,null,null,""]
[325,{"$f":"IF(W341=\"\",\"\",GETLat(W341))","v":""},{"$f":"IF(X341=\"\",\"\",GETLONG(X341))","v":""},"","","","",null,"",null,"",null,"",{"$f":"IF(U341=\"\", O341, MAPSYMBOL(O341, U341, $O$8))","v":""},"",null,null,null,null,null,null,null,null,null,""]
[326,{"$f":"IF(W342=\"\",\"\",GETLat(W342))","v":""},{"$f":"IF(X342=\"\",\"\",GETLONG(X342))","v":""},"","","","",null,"",null,"",null,"",{"$f":"IF(U342=\"\", O342, MAPSYMBOL(O342, U342, $O$8))","v":""},"",null,null,null,null,null,null,null,null,null,""]
[327,{"$f":"IF(W343=\"\",\"\",GETLat(W343))","v":""},{"$f":"IF(X343=\"\",\"\",GETLONG(X343))","v":""},"","","","",null,"",null,"",null,"",{"$f":"IF(U343=\"\", O343, MAPSYMBOL(O343, U343, $O$8))","v":""},"",null,null,null,null,null,null,null,null,null,""]
[328,{"$f":"IF(W344=\"\",\"\",GETLat(W344))","v":""},{"$f":"IF(X344=\"\",\"\",GETLONG(X344))","v":""},"","","","",null,"",null,"",null,"",{"$f":"IF(U344=\"\", O344, MAPSYMBOL(O344, U344, $O$8))","v":""},"",null,null,null,null,null,null,null,null,null,""]
[329,{"$f":"IF(W345=\"\",\"\",GETLat(W345))","v":""},{"$f":"IF(X345=\"\",\"\",GETLONG(X345))","v":""},"","","","",null,"",null,"",null,"",{"$f":"IF(U345=\"\", O345, MAPSYMBOL(O345, U345, $O$8))","v":""},"",null,null,null,null,null,null,null,null,null,""]
[330,{"$f":"IF(W346=\"\",\"\",GETLat(W346))","v":""},{"$f":"IF(X346=\"\",\"\",GETLONG(X346))","v":""},"","","","",null,"",null,"",null,"",{"$f":"IF(U346=\"\", O346, MAPSYMBOL(O346, U346, $O$8))","v":""},"",null,null,null,null,null,null,null,null,null,""]
[331,{"$f":"IF(W347=\"\",\"\",GETLat(W347))","v":""},{"$f":"IF(X347=\"\",\"\",GETLONG(X347))","v":""},"","","","",null,"",null,"",null,"",{"$f":"IF(U347=\"\", O347, MAPSYMBOL(O347, U347, $O$8))","v":""},"",null,null,null,null,null,null,null,null,null,""]
[332,{"$f":"IF(W348=\"\",\"\",GETLat(W348))","v":""},{"$f":"IF(X348=\"\",\"\",GETLONG(X348))","v":""},"","","","",null,"",null,"",null,"",{"$f":"IF(U348=\"\", O348, MAPSYMBOL(O348, U348, $O$8))","v":""},"",null,null,null,null,null,null,null,null,null,""]
[333,{"$f":"IF(W349=\"\",\"\",GETLat(W349))","v":""},{"$f":"IF(X349=\"\",\"\",GETLONG(X349))","v":""},"","","","",null,"",null,"",null,"",{"$f":"IF(U349=\"\", O349, MAPSYMBOL(O349, U349, $O$8))","v":""},"",null,null,null,null,null,null,null,null,null,""]
[334,{"$f":"IF(W350=\"\",\"\",GETLat(W350))","v":""},{"$f":"IF(X350=\"\",\"\",GETLONG(X350))","v":""},"","","","",null,"",null,"",null,"",{"$f":"IF(U350=\"\", O350, MAPSYMBOL(O350, U350, $O$8))","v":""},"",null,null,null,null,null,null,null,null,null,""]
[335,{"$f":"IF(W351=\"\",\"\",GETLat(W351))","v":""},{"$f":"IF(X351=\"\",\"\",GETLONG(X351))","v":""},"","","","",null,"",null,"",null,"",{"$f":"IF(U351=\"\", O351, MAPSYMBOL(O351, U351, $O$8))","v":""},"",null,null,null,null,null,null,null,null,null,""]
[336,{"$f":"IF(W352=\"\",\"\",GETLat(W352))","v":""},{"$f":"IF(X352=\"\",\"\",GETLONG(X352))","v":""},"","","","",null,"",null,"",null,"",{"$f":"IF(U352=\"\", O352, MAPSYMBOL(O352, U352, $O$8))","v":""},"",null,null,null,null,null,null,null,null,null,""]
[337,{"$f":"IF(W353=\"\",\"\",GETLat(W353))","v":""},{"$f":"IF(X353=\"\",\"\",GETLONG(X353))","v":""},"","","","",null,"",null,"",null,"",{"$f":"IF(U353=\"\", O353, MAPSYMBOL(O353, U353, $O$8))","v":""},"",null,null,null,null,null,null,null,null,null,""]
[338,{"$f":"IF(W354=\"\",\"\",GETLat(W354))","v":""},{"$f":"IF(X354=\"\",\"\",GETLONG(X354))","v":""},"","","","",null,"",null,"",null,"",{"$f":"IF(U354=\"\", O354, MAPSYMBOL(O354, U354, $O$8))","v":""},"",null,null,null,null,null,null,null,null,null,""]
[339,{"$f":"IF(W355=\"\",\"\",GETLat(W355))","v":""},{"$f":"IF(X355=\"\",\"\",GETLONG(X355))","v":""},"","","","",null,"",null,"",null,"",{"$f":"IF(U355=\"\", O355, MAPSYMBOL(O355, U355, $O$8))","v":""},"",null,null,null,null,null,null,null,null,null,""]
[340,{"$f":"IF(W356=\"\",\"\",GETLat(W356))","v":""},{"$f":"IF(X356=\"\",\"\",GETLONG(X356))","v":""},"","","","",null,"",null,"",null,"",{"$f":"IF(U356=\"\", O356, MAPSYMBOL(O356, U356, $O$8))","v":""},"",null,null,null,null,null,null,null,null,null,""]
[341,{"$f":"IF(W357=\"\",\"\",GETLat(W357))","v":""},{"$f":"IF(X357=\"\",\"\",GETLONG(X357))","v":""},"","","","",null,"",null,"",null,"",{"$f":"IF(U357=\"\", O357, MAPSYMBOL(O357, U357, $O$8))","v":""},"",null,null,null,null,null,null,null,null,null,""]
[342,{"$f":"IF(W358=\"\",\"\",GETLat(W358))","v":""},{"$f":"IF(X358=\"\",\"\",GETLONG(X358))","v":""},"","","","",null,"",null,"",null,"",{"$f":"IF(U358=\"\", O358, MAPSYMBOL(O358, U358, $O$8))","v":""},"",null,null,null,null,null,null,null,null,null,""]
[343,{"$f":"IF(W359=\"\",\"\",GETLat(W359))","v":""},{"$f":"IF(X359=\"\",\"\",GETLONG(X359))","v":""},"","","","",null,"",null,"",null,"",{"$f":"IF(U359=\"\", O359, MAPSYMBOL(O359, U359, $O$8))","v":""},"",null,null,null,null,null,null,null,null,null,""]
[344,{"$f":"IF(W360=\"\",\"\",GETLat(W360))","v":""},{"$f":"IF(X360=\"\",\"\",GETLONG(X360))","v":""},"","","","",null,"",null,"",null,"",{"$f":"IF(U360=\"\", O360, MAPSYMBOL(O360, U360, $O$8))","v":""},"",null,null,null,null,null,null,null,null,null,""]
[345,{"$f":"IF(W361=\"\",\"\",GETLat(W361))","v":""},{"$f":"IF(X361=\"\",\"\",GETLONG(X361))","v":""},"","","","",null,"",null,"",null,"",{"$f":"IF(U361=\"\", O361, MAPSYMBOL(O361, U361, $O$8))","v":""},"",null,null,null,null,null,null,null,null,null,""]
[346,{"$f":"IF(W362=\"\",\"\",GETLat(W362))","v":""},{"$f":"IF(X362=\"\",\"\",GETLONG(X362))","v":""},"","","","",null,"",null,"",null,"",{"$f":"IF(U362=\"\", O362, MAPSYMBOL(O362, U362, $O$8))","v":""},"",null,null,null,null,null,null,null,null,null,""]
[347,{"$f":"IF(W363=\"\",\"\",GETLat(W363))","v":""},{"$f":"IF(X363=\"\",\"\",GETLONG(X363))","v":""},"","","","",null,"",null,"",null,"",{"$f":"IF(U363=\"\", O363, MAPSYMBOL(O363, U363, $O$8))","v":""},"",null,null,null,null,null,null,null,null,null,""]
[348,{"$f":"IF(W364=\"\",\"\",GETLat(W364))","v":""},{"$f":"IF(X364=\"\",\"\",GETLONG(X364))","v":""},"","","","",null,"",null,"",null,"",{"$f":"IF(U364=\"\", O364, MAPSYMBOL(O364, U364, $O$8))","v":""},"",null,null,null,null,null,null,null,null,null,""]
[349,{"$f":"IF(W365=\"\",\"\",GETLat(W365))","v":""},{"$f":"IF(X365=\"\",\"\",GETLONG(X365))","v":""},"","","","",null,"",null,"",null,"",{"$f":"IF(U365=\"\", O365, MAPSYMBOL(O365, U365, $O$8))","v":""},"",null,null,null,null,null,null,null,null,null,""]
[350,{"$f":"IF(W366=\"\",\"\",GETLat(W366))","v":""},{"$f":"IF(X366=\"\",\"\",GETLONG(X366))","v":""},"","","","",null,"",null,"",null,"",{"$f":"IF(U366=\"\", O366, MAPSYMBOL(O366, U366, $O$8))","v":""},"",null,null,null,null,null,null,null,null,null,""]
[351,{"$f":"IF(W367=\"\",\"\",GETLat(W367))","v":""},{"$f":"IF(X367=\"\",\"\",GETLONG(X367))","v":""},"","","","",null,"",null,"",null,"",{"$f":"IF(U367=\"\", O367, MAPSYMBOL(O367, U367, $O$8))","v":""},"",null,null,null,null,null,null,null,null,null,""]
[352,{"$f":"IF(W368=\"\",\"\",GETLat(W368))","v":""},{"$f":"IF(X368=\"\",\"\",GETLONG(X368))","v":""},"","","","",null,"",null,"",null,"",{"$f":"IF(U368=\"\", O368, MAPSYMBOL(O368, U368, $O$8))","v":""},"",null,null,null,null,null,null,null,null,null,""]
[353,{"$f":"IF(W369=\"\",\"\",GETLat(W369))","v":""},{"$f":"IF(X369=\"\",\"\",GETLONG(X369))","v":""},"","","","",null,"",null,"",null,"",{"$f":"IF(U369=\"\", O369, MAPSYMBOL(O369, U369, $O$8))","v":""},"",null,null,null,null,null,null,null,null,null,""]
[354,{"$f":"IF(W370=\"\",\"\",GETLat(W370))","v":""},{"$f":"IF(X370=\"\",\"\",GETLONG(X370))","v":""},"","","","",null,"",null,"",null,"",{"$f":"IF(U370=\"\", O370, MAPSYMBOL(O370, U370, $O$8))","v":""},"",null,null,null,null,null,null,null,null,null,""]
[355,{"$f":"IF(W371=\"\",\"\",GETLat(W371))","v":""},{"$f":"IF(X371=\"\",\"\",GETLONG(X371))","v":""},"","","","",null,"",null,"",null,"",{"$f":"IF(U371=\"\", O371, MAPSYMBOL(O371, U371, $O$8))","v":""},"",null,null,null,null,null,null,null,null,null,""]
[356,{"$f":"IF(W372=\"\",\"\",GETLat(W372))","v":""},{"$f":"IF(X372=\"\",\"\",GETLONG(X372))","v":""},"","","","",null,"",null,"",null,"",{"$f":"IF(U372=\"\", O372, MAPSYMBOL(O372, U372, $O$8))","v":""},"",null,null,null,null,null,null,null,null,null,""]
[357,{"$f":"IF(W373=\"\",\"\",GETLat(W373))","v":""},{"$f":"IF(X373=\"\",\"\",GETLONG(X373))","v":""},"","","","",null,"",null,"",null,"",{"$f":"IF(U373=\"\", O373, MAPSYMBOL(O373, U373, $O$8))","v":""},"",null,null,null,null,null,null,null,null,null,""]
[358,{"$f":"IF(W374=\"\",\"\",GETLat(W374))","v":""},{"$f":"IF(X374=\"\",\"\",GETLONG(X374))","v":""},"","","","",null,"",null,"",null,"",{"$f":"IF(U374=\"\", O374, MAPSYMBOL(O374, U374, $O$8))","v":""},"",null,null,null,null,null,null,null,null,null,""]
[359,{"$f":"IF(W375=\"\",\"\",GETLat(W375))","v":""},{"$f":"IF(X375=\"\",\"\",GETLONG(X375))","v":""},"","","","",null,"",null,"",null,"",{"$f":"IF(U375=\"\", O375, MAPSYMBOL(O375, U375, $O$8))","v":""},"",null,null,null,null,null,null,null,null,null,""]
[360,{"$f":"IF(W376=\"\",\"\",GETLat(W376))","v":""},{"$f":"IF(X376=\"\",\"\",GETLONG(X376))","v":""},"","","","",null,"",null,"",null,"",{"$f":"IF(U376=\"\", O376, MAPSYMBOL(O376, U376, $O$8))","v":""},"",null,null,null,null,null,null,null,null,null,""]
[361,{"$f":"IF(W377=\"\",\"\",GETLat(W377))","v":""},{"$f":"IF(X377=\"\",\"\",GETLONG(X377))","v":""},"","","","",null,"",null,"",null,"",{"$f":"IF(U377=\"\", O377, MAPSYMBOL(O377, U377, $O$8))","v":""},"",null,null,null,null,null,null,null,null,null,""]
[362,{"$f":"IF(W378=\"\",\"\",GETLat(W378))","v":""},{"$f":"IF(X378=\"\",\"\",GETLONG(X378))","v":""},"","","","",null,"",null,"",null,"",{"$f":"IF(U378=\"\", O378, MAPSYMBOL(O378, U378, $O$8))","v":""},"",null,null,null,null,null,null,null,null,null,""]
[363,{"$f":"IF(W379=\"\",\"\",GETLat(W379))","v":""},{"$f":"IF(X379=\"\",\"\",GETLONG(X379))","v":""},"","","","",null,"",null,"",null,"",{"$f":"IF(U379=\"\", O379, MAPSYMBOL(O379, U379, $O$8))","v":""},"",null,null,null,null,null,null,null,null,null,""]
[364,{"$f":"IF(W380=\"\",\"\",GETLat(W380))","v":""},{"$f":"IF(X380=\"\",\"\",GETLONG(X380))","v":""},"","","","",null,"",null,"",null,"",{"$f":"IF(U380=\"\", O380, MAPSYMBOL(O380, U380, $O$8))","v":""},"",null,null,null,null,null,null,null,null,null,""]
[365,{"$f":"IF(W381=\"\",\"\",GETLat(W381))","v":""},{"$f":"IF(X381=\"\",\"\",GETLONG(X381))","v":""},"","","","",null,"",null,"",null,"",{"$f":"IF(U381=\"\", O381, MAPSYMBOL(O381, U381, $O$8))","v":""},"",null,null,null,null,null,null,null,null,null,""]
[366,{"$f":"IF(W382=\"\",\"\",GETLat(W382))","v":""},{"$f":"IF(X382=\"\",\"\",GETLONG(X382))","v":""},"","","","",null,"",null,"",null,"",{"$f":"IF(U382=\"\", O382, MAPSYMBOL(O382, U382, $O$8))","v":""},"",null,null,null,null,null,null,null,null,null,""]
[367,{"$f":"IF(W383=\"\",\"\",GETLat(W383))","v":""},{"$f":"IF(X383=\"\",\"\",GETLONG(X383))","v":""},"","","","",null,"",null,"",null,"",{"$f":"IF(U383=\"\", O383, MAPSYMBOL(O383, U383, $O$8))","v":""},"",null,null,null,null,null,null,null,null,null,""]
[368,{"$f":"IF(W384=\"\",\"\",GETLat(W384))","v":""},{"$f":"IF(X384=\"\",\"\",GETLONG(X384))","v":""},"","","","",null,"",null,"",null,"",{"$f":"IF(U384=\"\", O384, MAPSYMBOL(O384, U384, $O$8))","v":""},"",null,null,null,null,null,null,null,null,null,""]
[369,{"$f":"IF(W385=\"\",\"\",GETLat(W385))","v":""},{"$f":"IF(X385=\"\",\"\",GETLONG(X385))","v":""},"","","","",null,"",null,"",null,"",{"$f":"IF(U385=\"\", O385, MAPSYMBOL(O385, U385, $O$8))","v":""},"",null,null,null,null,null,null,null,null,null,""]
[370,{"$f":"IF(W386=\"\",\"\",GETLat(W386))","v":""},{"$f":"IF(X386=\"\",\"\",GETLONG(X386))","v":""},"","","","",null,"",null,"",null,"",{"$f":"IF(U386=\"\", O386, MAPSYMBOL(O386, U386, $O$8))","v":""},"",null,null,null,null,null,null,null,null,null,""]
[371,{"$f":"IF(W387=\"\",\"\",GETLat(W387))","v":""},{"$f":"IF(X387=\"\",\"\",GETLONG(X387))","v":""},"","","","",null,"",null,"",null,"",{"$f":"IF(U387=\"\", O387, MAPSYMBOL(O387, U387, $O$8))","v":""},"",null,null,null,null,null,null,null,null,null,""]
[372,{"$f":"IF(W388=\"\",\"\",GETLat(W388))","v":""},{"$f":"IF(X388=\"\",\"\",GETLONG(X388))","v":""},"","","","",null,"",null,"",null,"",{"$f":"IF(U388=\"\", O388, MAPSYMBOL(O388, U388, $O$8))","v":""},"",null,null,null,null,null,null,null,null,null,""]
[373,{"$f":"IF(W389=\"\",\"\",GETLat(W389))","v":""},{"$f":"IF(X389=\"\",\"\",GETLONG(X389))","v":""},"","","","",null,"",null,"",null,"",{"$f":"IF(U389=\"\", O389, MAPSYMBOL(O389, U389, $O$8))","v":""},"",null,null,null,null,null,null,null,null,null,""]
[374,{"$f":"IF(W390=\"\",\"\",GETLat(W390))","v":""},{"$f":"IF(X390=\"\",\"\",GETLONG(X390))","v":""},"","","","",null,"",null,"",null,"",{"$f":"IF(U390=\"\", O390, MAPSYMBOL(O390, U390, $O$8))","v":""},"",null,null,null,null,null,null,null,null,null,""]
[375,{"$f":"IF(W391=\"\",\"\",GETLat(W391))","v":""},{"$f":"IF(X391=\"\",\"\",GETLONG(X391))","v":""},"","","","",null,"",null,"",null,"",{"$f":"IF(U391=\"\", O391, MAPSYMBOL(O391, U391, $O$8))","v":""},"",null,null,null,null,null,null,null,null,null,""]
[376,{"$f":"IF(W392=\"\",\"\",GETLat(W392))","v":""},{"$f":"IF(X392=\"\",\"\",GETLONG(X392))","v":""},"","","","",null,"",null,"",null,"",{"$f":"IF(U392=\"\", O392, MAPSYMBOL(O392, U392, $O$8))","v":""},"",null,null,null,null,null,null,null,null,null,""]
[377,{"$f":"IF(W393=\"\",\"\",GETLat(W393))","v":""},{"$f":"IF(X393=\"\",\"\",GETLONG(X393))","v":""},"","","","",null,"",null,"",null,"",{"$f":"IF(U393=\"\", O393, MAPSYMBOL(O393, U393, $O$8))","v":""},"",null,null,null,null,null,null,null,null,null,""]
[378,{"$f":"IF(W394=\"\",\"\",GETLat(W394))","v":""},{"$f":"IF(X394=\"\",\"\",GETLONG(X394))","v":""},"","","","",null,"",null,"",null,"",{"$f":"IF(U394=\"\", O394, MAPSYMBOL(O394, U394, $O$8))","v":""},"",null,null,null,null,null,null,null,null,null,""]
[379,{"$f":"IF(W395=\"\",\"\",GETLat(W395))","v":""},{"$f":"IF(X395=\"\",\"\",GETLONG(X395))","v":""},"","","","",null,"",null,"",null,"",{"$f":"IF(U395=\"\", O395, MAPSYMBOL(O395, U395, $O$8))","v":""},"",null,null,null,null,null,null,null,null,null,""]
[380,{"$f":"IF(W396=\"\",\"\",GETLat(W396))","v":""},{"$f":"IF(X396=\"\",\"\",GETLONG(X396))","v":""},"","","","",null,"",null,"",null,"",{"$f":"IF(U396=\"\", O396, MAPSYMBOL(O396, U396, $O$8))","v":""},"",null,null,null,null,null,null,null,null,null,""]
[381,{"$f":"IF(W397=\"\",\"\",GETLat(W397))","v":""},{"$f":"IF(X397=\"\",\"\",GETLONG(X397))","v":""},"","","","",null,"",null,"",null,"",{"$f":"IF(U397=\"\", O397, MAPSYMBOL(O397, U397, $O$8))","v":""},"",null,null,null,null,null,null,null,null,null,""]
[382,{"$f":"IF(W398=\"\",\"\",GETLat(W398))","v":""},{"$f":"IF(X398=\"\",\"\",GETLONG(X398))","v":""},"","","","",null,"",null,"",null,"",{"$f":"IF(U398=\"\", O398, MAPSYMBOL(O398, U398, $O$8))","v":""},"",null,null,null,null,null,null,null,null,null,""]
[383,{"$f":"IF(W399=\"\",\"\",GETLat(W399))","v":""},{"$f":"IF(X399=\"\",\"\",GETLONG(X399))","v":""},"","","","",null,"",null,"",null,"",{"$f":"IF(U399=\"\", O399, MAPSYMBOL(O399, U399, $O$8))","v":""},"",null,null,null,null,null,null,null,null,null,""]
[384,{"$f":"IF(W400=\"\",\"\",GETLat(W400))","v":""},{"$f":"IF(X400=\"\",\"\",GETLONG(X400))","v":""},"","","","",null,"",null,"",null,"",{"$f":"IF(U400=\"\", O400, MAPSYMBOL(O400, U400, $O$8))","v":""},"",null,null,null,null,null,null,null,null,null,""]
[385,{"$f":"IF(W401=\"\",\"\",GETLat(W401))","v":""},{"$f":"IF(X401=\"\",\"\",GETLONG(X401))","v":""},{"$f":"NamePlus($O$7, S401, T401, U401, V401)","v":""},{"$f":"IF(V401=\"\",\"\",V401)","v":""},{"$f":"IF(T401=\"\",\"\",IF($F$9 = TRUE,T401,\"\"))","v":""},{"$f":"N401","v":""},null,{"$f":"IF(S401=\"\",\"\",S401)","v":""},null,{"$f":"IF(J401<>\"\",T401,\"\")","v":""},null,{"$f":"IF(T401=\"\",\"\",T401)","v":""},{"$f":"IF(U401=\"\", O401, MAPSYMBOL(O401, U401, $O$8))","v":""},{"$f":"IF(OR(W401=\"\",X401=\"\"),\"\",VLOOKUP(T401,$M$4:$N$12,2,TRUE))","v":""},null,null,null,null,null,null,null,null,null,""]
[386,{"$f":"IF(W402=\"\",\"\",GETLat(W402))","v":""},{"$f":"IF(X402=\"\",\"\",GETLONG(X402))","v":""},"","","","",null,"",null,"",null,"",{"$f":"IF(U402=\"\", O402, MAPSYMBOL(O402, U402, $O$8))","v":""},"",null,null,null,null,null,null,null,null,null,{"$f":"IF(OR(W402=\"\",X402=\"\"),\"\",HYPERLINK(\"https://maps.google.com/maps?q=\"&B402&\",\"&C402))","v":""}]
[387,{"$f":"IF(W403=\"\",\"\",GETLat(W403))","v":""},{"$f":"IF(X403=\"\",\"\",GETLONG(X403))","v":""},"","","","",null,"",null,"",null,"",{"$f":"IF(U403=\"\", O403, MAPSYMBOL(O403, U403, $O$8))","v":""},"",null,null,null,null,null,null,null,null,null,""]
[388,{"$f":"IF(W404=\"\",\"\",GETLat(W404))","v":""},{"$f":"IF(X404=\"\",\"\",GETLONG(X404))","v":""},"","","","",null,"",null,"",null,"",{"$f":"IF(U404=\"\", O404, MAPSYMBOL(O404, U404, $O$8))","v":""},"",null,null,null,null,null,null,null,null,null,""]
[389,{"$f":"IF(W405=\"\",\"\",GETLat(W405))","v":""},{"$f":"IF(X405=\"\",\"\",GETLONG(X405))","v":""},"","","","",null,"",null,"",null,"",{"$f":"IF(U405=\"\", O405, MAPSYMBOL(O405, U405, $O$8))","v":""},"",null,null,null,null,null,null,null,null,null,""]
[390,{"$f":"IF(W406=\"\",\"\",GETLat(W406))","v":""},{"$f":"IF(X406=\"\",\"\",GETLONG(X406))","v":""},"","","","",null,"",null,"",null,"",{"$f":"IF(U406=\"\", O406, MAPSYMBOL(O406, U406, $O$8))","v":""},"",null,null,null,null,null,null,null,null,null,""]
[391,{"$f":"IF(W407=\"\",\"\",GETLat(W407))","v":""},{"$f":"IF(X407=\"\",\"\",GETLONG(X407))","v":""},"","","","",null,"",null,"",null,"",{"$f":"IF(U407=\"\", O407, MAPSYMBOL(O407, U407, $O$8))","v":""},"",null,null,null,null,null,null,null,null,null,""]
[392,{"$f":"IF(W408=\"\",\"\",GETLat(W408))","v":""},{"$f":"IF(X408=\"\",\"\",GETLONG(X408))","v":""},"","","","",null,"",null,"",null,"",{"$f":"IF(U408=\"\", O408, MAPSYMBOL(O408, U408, $O$8))","v":""},"",null,null,null,null,null,null,null,null,null,""]
[393,{"$f":"IF(W409=\"\",\"\",GETLat(W409))","v":""},{"$f":"IF(X409=\"\",\"\",GETLONG(X409))","v":""},"","","","",null,"",null,"",null,"",{"$f":"IF(U409=\"\", O409, MAPSYMBOL(O409, U409, $O$8))","v":""},"",null,null,null,null,null,null,null,null,null,""]
[394,{"$f":"IF(W410=\"\",\"\",GETLat(W410))","v":""},{"$f":"IF(X410=\"\",\"\",GETLONG(X410))","v":""},"","","","",null,"",null,"",null,"",{"$f":"IF(U410=\"\", O410, MAPSYMBOL(O410, U410, $O$8))","v":""},"",null,null,null,null,null,null,null,null,null,""]
[395,{"$f":"IF(W411=\"\",\"\",GETLat(W411))","v":""},{"$f":"IF(X411=\"\",\"\",GETLONG(X411))","v":""},"","","","",null,"",null,"",null,"",{"$f":"IF(U411=\"\", O411, MAPSYMBOL(O411, U411, $O$8))","v":""},"",null,null,null,null,null,null,null,null,null,""]
[396,{"$f":"IF(W412=\"\",\"\",GETLat(W412))","v":""},{"$f":"IF(X412=\"\",\"\",GETLONG(X412))","v":""},"","","","",null,"",null,"",null,"",{"$f":"IF(U412=\"\", O412, MAPSYMBOL(O412, U412, $O$8))","v":""},"",null,null,null,null,null,null,null,null,null,""]
[397,{"$f":"IF(W413=\"\",\"\",GETLat(W413))","v":""},{"$f":"IF(X413=\"\",\"\",GETLONG(X413))","v":""},"","","","",null,"",null,"",null,"",{"$f":"IF(U413=\"\", O413, MAPSYMBOL(O413, U413, $O$8))","v":""},"",null,null,null,null,null,null,null,null,null,""]
[398,{"$f":"IF(W414=\"\",\"\",GETLat(W414))","v":""},{"$f":"IF(X414=\"\",\"\",GETLONG(X414))","v":""},"","","","",null,"",null,"",null,"",{"$f":"IF(U414=\"\", O414, MAPSYMBOL(O414, U414, $O$8))","v":""},"",null,null,null,null,null,null,null,null,null,""]
[399,{"$f":"IF(W415=\"\",\"\",GETLat(W415))","v":""},{"$f":"IF(X415=\"\",\"\",GETLONG(X415))","v":""},"","","","",null,"",null,"",null,"",{"$f":"IF(U415=\"\", O415, MAPSYMBOL(O415, U415, $O$8))","v":""},"",null,null,null,null,null,null,null,null,null,""]
[400,{"$f":"IF(W416=\"\",\"\",GETLat(W416))","v":""},{"$f":"IF(X416=\"\",\"\",GETLONG(X416))","v":""},"","","","",null,"",null,"",null,"",{"$f":"IF(U416=\"\", O416, MAPSYMBOL(O416, U416, $O$8))","v":""},"",null,null,null,null,null,null,null,null,null,""]
[401,{"$f":"IF(W417=\"\",\"\",GETLat(W417))","v":""},{"$f":"IF(X417=\"\",\"\",GETLONG(X417))","v":""},"","","","",null,"",null,"",null,"",{"$f":"IF(U417=\"\", O417, MAPSYMBOL(O417, U417, $O$8))","v":""},"",null,null,null,null,null,null,null,null,null,""]
[402,{"$f":"IF(W418=\"\",\"\",GETLat(W418))","v":""},{"$f":"IF(X418=\"\",\"\",GETLONG(X418))","v":""},"","","","",null,"",null,"",null,"",{"$f":"IF(U418=\"\", O418, MAPSYMBOL(O418, U418, $O$8))","v":""},"",null,null,null,null,null,null,null,null,null,""]
[403,{"$f":"IF(W419=\"\",\"\",GETLat(W419))","v":""},{"$f":"IF(X419=\"\",\"\",GETLONG(X419))","v":""},"","","","",null,"",null,"",null,"",{"$f":"IF(U419=\"\", O419, MAPSYMBOL(O419, U419, $O$8))","v":""},"",null,null,null,null,null,null,null,null,null,""]
[404,{"$f":"IF(W420=\"\",\"\",GETLat(W420))","v":""},{"$f":"IF(X420=\"\",\"\",GETLONG(X420))","v":""},"","","","",null,"",null,"",null,"",{"$f":"IF(U420=\"\", O420, MAPSYMBOL(O420, U420, $O$8))","v":""},"",null,null,null,null,null,null,null,null,null,""]
[405,{"$f":"IF(W421=\"\",\"\",GETLat(W421))","v":""},{"$f":"IF(X421=\"\",\"\",GETLONG(X421))","v":""},"","","","",null,"",null,"",null,"",{"$f":"IF(U421=\"\", O421, MAPSYMBOL(O421, U421, $O$8))","v":""},"",null,null,null,null,null,null,null,null,null,""]
[406,{"$f":"IF(W422=\"\",\"\",GETLat(W422))","v":""},{"$f":"IF(X422=\"\",\"\",GETLONG(X422))","v":""},"","","","",null,"",null,"",null,"",{"$f":"IF(U422=\"\", O422, MAPSYMBOL(O422, U422, $O$8))","v":""},"",null,null,null,null,null,null,null,null,null,""]
[407,{"$f":"IF(W423=\"\",\"\",GETLat(W423))","v":""},{"$f":"IF(X423=\"\",\"\",GETLONG(X423))","v":""},"","","","",null,"",null,"",null,"",{"$f":"IF(U423=\"\", O423, MAPSYMBOL(O423, U423, $O$8))","v":""},"",null,null,null,null,null,null,null,null,null,""]
[408,{"$f":"IF(W424=\"\",\"\",GETLat(W424))","v":""},{"$f":"IF(X424=\"\",\"\",GETLONG(X424))","v":""},"","","","",null,"",null,"",null,"",{"$f":"IF(U424=\"\", O424, MAPSYMBOL(O424, U424, $O$8))","v":""},"",null,null,null,null,null,null,null,null,null,""]
[409,{"$f":"IF(W425=\"\",\"\",GETLat(W425))","v":""},{"$f":"IF(X425=\"\",\"\",GETLONG(X425))","v":""},"","","","",null,"",null,"",null,"",{"$f":"IF(U425=\"\", O425, MAPSYMBOL(O425, U425, $O$8))","v":""},"",null,null,null,null,null,null,null,null,null,""]
[410,{"$f":"IF(W426=\"\",\"\",GETLat(W426))","v":""},{"$f":"IF(X426=\"\",\"\",GETLONG(X426))","v":""},"","","","",null,"",null,"",null,"",{"$f":"IF(U426=\"\", O426, MAPSYMBOL(O426, U426, $O$8))","v":""},"",null,null,null,null,null,null,null,null,null,""]
[411,{"$f":"IF(W427=\"\",\"\",GETLat(W427))","v":""},{"$f":"IF(X427=\"\",\"\",GETLONG(X427))","v":""},"","","","",null,"",null,"",null,"",{"$f":"IF(U427=\"\", O427, MAPSYMBOL(O427, U427, $O$8))","v":""},"",null,null,null,null,null,null,null,null,null,""]
[412,{"$f":"IF(W428=\"\",\"\",GETLat(W428))","v":""},{"$f":"IF(X428=\"\",\"\",GETLONG(X428))","v":""},"","","","",null,"",null,"",null,"",{"$f":"IF(U428=\"\", O428, MAPSYMBOL(O428, U428, $O$8))","v":""},"",null,null,null,null,null,null,null,null,null,""]
[413,{"$f":"IF(W429=\"\",\"\",GETLat(W429))","v":""},{"$f":"IF(X429=\"\",\"\",GETLONG(X429))","v":""},"","","","",null,"",null,"",null,"",{"$f":"IF(U429=\"\", O429, MAPSYMBOL(O429, U429, $O$8))","v":""},"",null,null,null,null,null,null,null,null,null,""]
[414,{"$f":"IF(W430=\"\",\"\",GETLat(W430))","v":""},{"$f":"IF(X430=\"\",\"\",GETLONG(X430))","v":""},"","","","",null,"",null,"",null,"",{"$f":"IF(U430=\"\", O430, MAPSYMBOL(O430, U430, $O$8))","v":""},"",null,null,null,null,null,null,null,null,null,""]
[415,{"$f":"IF(W431=\"\",\"\",GETLat(W431))","v":""},{"$f":"IF(X431=\"\",\"\",GETLONG(X431))","v":""},"","","","",null,"",null,"",null,"",{"$f":"IF(U431=\"\", O431, MAPSYMBOL(O431, U431, $O$8))","v":""},"",null,null,null,null,null,null,null,null,null,""]
[416,{"$f":"IF(W432=\"\",\"\",GETLat(W432))","v":""},{"$f":"IF(X432=\"\",\"\",GETLONG(X432))","v":""},"","","","",null,"",null,"",null,"",{"$f":"IF(U432=\"\", O432, MAPSYMBOL(O432, U432, $O$8))","v":""},"",null,null,null,null,null,null,null,null,null,""]
[417,{"$f":"IF(W433=\"\",\"\",GETLat(W433))","v":""},{"$f":"IF(X433=\"\",\"\",GETLONG(X433))","v":""},"","","","",null,"",null,"",null,"",{"$f":"IF(U433=\"\", O433, MAPSYMBOL(O433, U433, $O$8))","v":""},"",null,null,null,null,null,null,null,null,null,""]
[418,{"$f":"IF(W434=\"\",\"\",GETLat(W434))","v":""},{"$f":"IF(X434=\"\",\"\",GETLONG(X434))","v":""},"","","","",null,"",null,"",null,"",{"$f":"IF(U434=\"\", O434, MAPSYMBOL(O434, U434, $O$8))","v":""},"",null,null,null,null,null,null,null,null,null,""]
[419,{"$f":"IF(W435=\"\",\"\",GETLat(W435))","v":""},{"$f":"IF(X435=\"\",\"\",GETLONG(X435))","v":""},"","","","",null,"",null,"",null,"",{"$f":"IF(U435=\"\", O435, MAPSYMBOL(O435, U435, $O$8))","v":""},"",null,null,null,null,null,null,null,null,null,""]
[420,{"$f":"IF(W436=\"\",\"\",GETLat(W436))","v":""},{"$f":"IF(X436=\"\",\"\",GETLONG(X436))","v":""},"","","","",null,"",null,"",null,"",{"$f":"IF(U436=\"\", O436, MAPSYMBOL(O436, U436, $O$8))","v":""},"",null,null,null,null,null,null,null,null,null,""]
[421,{"$f":"IF(W437=\"\",\"\",GETLat(W437))","v":""},{"$f":"IF(X437=\"\",\"\",GETLONG(X437))","v":""},"","","","",null,"",null,"",null,"",{"$f":"IF(U437=\"\", O437, MAPSYMBOL(O437, U437, $O$8))","v":""},"",null,null,null,null,null,null,null,null,null,""]
[422,{"$f":"IF(W438=\"\",\"\",GETLat(W438))","v":""},{"$f":"IF(X438=\"\",\"\",GETLONG(X438))","v":""},"","","","",null,"",null,"",null,"",{"$f":"IF(U438=\"\", O438, MAPSYMBOL(O438, U438, $O$8))","v":""},"",null,null,null,null,null,null,null,null,null,""]
[423,{"$f":"IF(W439=\"\",\"\",GETLat(W439))","v":""},{"$f":"IF(X439=\"\",\"\",GETLONG(X439))","v":""},"","","","",null,"",null,"",null,"",{"$f":"IF(U439=\"\", O439, MAPSYMBOL(O439, U439, $O$8))","v":""},"",null,null,null,null,null,null,null,null,null,""]
[424,{"$f":"IF(W440=\"\",\"\",GETLat(W440))","v":""},{"$f":"IF(X440=\"\",\"\",GETLONG(X440))","v":""},"","","","",null,"",null,"",null,"",{"$f":"IF(U440=\"\", O440, MAPSYMBOL(O440, U440, $O$8))","v":""},"",null,null,null,null,null,null,null,null,null,""]
[425,{"$f":"IF(W441=\"\",\"\",GETLat(W441))","v":""},{"$f":"IF(X441=\"\",\"\",GETLONG(X441))","v":""},"","","","",null,"",null,"",null,"",{"$f":"IF(U441=\"\", O441, MAPSYMBOL(O441, U441, $O$8))","v":""},"",null,null,null,null,null,null,null,null,null,""]
[426,{"$f":"IF(W442=\"\",\"\",GETLat(W442))","v":""},{"$f":"IF(X442=\"\",\"\",GETLONG(X442))","v":""},"","","","",null,"",null,"",null,"",{"$f":"IF(U442=\"\", O442, MAPSYMBOL(O442, U442, $O$8))","v":""},"",null,null,null,null,null,null,null,null,null,""]
[427,{"$f":"IF(W443=\"\",\"\",GETLat(W443))","v":""},{"$f":"IF(X443=\"\",\"\",GETLONG(X443))","v":""},"","","","",null,"",null,"",null,"",{"$f":"IF(U443=\"\", O443, MAPSYMBOL(O443, U443, $O$8))","v":""},"",null,null,null,null,null,null,null,null,null,""]
[428,{"$f":"IF(W444=\"\",\"\",GETLat(W444))","v":""},{"$f":"IF(X444=\"\",\"\",GETLONG(X444))","v":""},"","","","",null,"",null,"",null,"",{"$f":"IF(U444=\"\", O444, MAPSYMBOL(O444, U444, $O$8))","v":""},"",null,null,null,null,null,null,null,null,null,""]
[429,{"$f":"IF(W445=\"\",\"\",GETLat(W445))","v":""},{"$f":"IF(X445=\"\",\"\",GETLONG(X445))","v":""},"","","","",null,"",null,"",null,"",{"$f":"IF(U445=\"\", O445, MAPSYMBOL(O445, U445, $O$8))","v":""},"",null,null,null,null,null,null,null,null,null,""]
[430,{"$f":"IF(W446=\"\",\"\",GETLat(W446))","v":""},{"$f":"IF(X446=\"\",\"\",GETLONG(X446))","v":""},"","","","",null,"",null,"",null,"",{"$f":"IF(U446=\"\", O446, MAPSYMBOL(O446, U446, $O$8))","v":""},"",null,null,null,null,null,null,null,null,null,""]
[431,{"$f":"IF(W447=\"\",\"\",GETLat(W447))","v":""},{"$f":"IF(X447=\"\",\"\",GETLONG(X447))","v":""},"","","","",null,"",null,"",null,"",{"$f":"IF(U447=\"\", O447, MAPSYMBOL(O447, U447, $O$8))","v":""},"",null,null,null,null,null,null,null,null,null,""]
[432,{"$f":"IF(W448=\"\",\"\",GETLat(W448))","v":""},{"$f":"IF(X448=\"\",\"\",GETLONG(X448))","v":""},"","","","",null,"",null,"",null,"",{"$f":"IF(U448=\"\", O448, MAPSYMBOL(O448, U448, $O$8))","v":""},"",null,null,null,null,null,null,null,null,null,""]
[433,{"$f":"IF(W449=\"\",\"\",GETLat(W449))","v":""},{"$f":"IF(X449=\"\",\"\",GETLONG(X449))","v":""},"","","","",null,"",null,"",null,"",{"$f":"IF(U449=\"\", O449, MAPSYMBOL(O449, U449, $O$8))","v":""},"",null,null,null,null,null,null,null,null,null,""]
[434,{"$f":"IF(W450=\"\",\"\",GETLat(W450))","v":""},{"$f":"IF(X450=\"\",\"\",GETLONG(X450))","v":""},"","","","",null,"",null,"",null,"",{"$f":"IF(U450=\"\", O450, MAPSYMBOL(O450, U450, $O$8))","v":""},"",null,null,null,null,null,null,null,null,null,""]
[435,{"$f":"IF(W451=\"\",\"\",GETLat(W451))","v":""},{"$f":"IF(X451=\"\",\"\",GETLONG(X451))","v":""},"","","","",null,"",null,"",null,"",{"$f":"IF(U451=\"\", O451, MAPSYMBOL(O451, U451, $O$8))","v":""},"",null,null,null,null,null,null,null,null,null,""]
[436,{"$f":"IF(W452=\"\",\"\",GETLat(W452))","v":""},{"$f":"IF(X452=\"\",\"\",GETLONG(X452))","v":""},"","","","",null,"",null,"",null,"",{"$f":"IF(U452=\"\", O452, MAPSYMBOL(O452, U452, $O$8))","v":""},"",null,null,null,null,null,null,null,null,null,""]
[437,{"$f":"IF(W453=\"\",\"\",GETLat(W453))","v":""},{"$f":"IF(X453=\"\",\"\",GETLONG(X453))","v":""},"","","","",null,"",null,"",null,"",{"$f":"IF(U453=\"\", O453, MAPSYMBOL(O453, U453, $O$8))","v":""},"",null,null,null,null,null,null,null,null,null,""]
[438,{"$f":"IF(W454=\"\",\"\",GETLat(W454))","v":""},{"$f":"IF(X454=\"\",\"\",GETLONG(X454))","v":""},"","","","",null,"",null,"",null,"",{"$f":"IF(U454=\"\", O454, MAPSYMBOL(O454, U454, $O$8))","v":""},"",null,null,null,null,null,null,null,null,null,""]
[439,{"$f":"IF(W455=\"\",\"\",GETLat(W455))","v":""},{"$f":"IF(X455=\"\",\"\",GETLONG(X455))","v":""},"","","","",null,"",null,"",null,"",{"$f":"IF(U455=\"\", O455, MAPSYMBOL(O455, U455, $O$8))","v":""},"",null,null,null,null,null,null,null,null,null,""]
[440,{"$f":"IF(W456=\"\",\"\",GETLat(W456))","v":""},{"$f":"IF(X456=\"\",\"\",GETLONG(X456))","v":""},"","","","",null,"",null,"",null,"",{"$f":"IF(U456=\"\", O456, MAPSYMBOL(O456, U456, $O$8))","v":""},"",null,null,null,null,null,null,null,null,null,""]
[441,{"$f":"IF(W457=\"\",\"\",GETLat(W457))","v":""},{"$f":"IF(X457=\"\",\"\",GETLONG(X457))","v":""},"","","","",null,"",null,"",null,"",{"$f":"IF(U457=\"\", O457, MAPSYMBOL(O457, U457, $O$8))","v":""},"",null,null,null,null,null,null,null,null,null,""]
[442,{"$f":"IF(W458=\"\",\"\",GETLat(W458))","v":""},{"$f":"IF(X458=\"\",\"\",GETLONG(X458))","v":""},"","","","",null,"",null,"",null,"",{"$f":"IF(U458=\"\", O458, MAPSYMBOL(O458, U458, $O$8))","v":""},"",null,null,null,null,null,null,null,null,null,""]
[443,{"$f":"IF(W459=\"\",\"\",GETLat(W459))","v":""},{"$f":"IF(X459=\"\",\"\",GETLONG(X459))","v":""},"","","","",null,"",null,"",null,"",{"$f":"IF(U459=\"\", O459, MAPSYMBOL(O459, U459, $O$8))","v":""},"",null,null,null,null,null,null,null,null,null,""]
[444,{"$f":"IF(W460=\"\",\"\",GETLat(W460))","v":""},{"$f":"IF(X460=\"\",\"\",GETLONG(X460))","v":""},"","","","",null,"",null,"",null,"",{"$f":"IF(U460=\"\", O460, MAPSYMBOL(O460, U460, $O$8))","v":""},"",null,null,null,null,null,null,null,null,null,""]
[445,{"$f":"IF(W461=\"\",\"\",GETLat(W461))","v":""},{"$f":"IF(X461=\"\",\"\",GETLONG(X461))","v":""},"","","","",null,"",null,"",null,"",{"$f":"IF(U461=\"\", O461, MAPSYMBOL(O461, U461, $O$8))","v":""},"",null,null,null,null,null,null,null,null,null,""]
[446,{"$f":"IF(W462=\"\",\"\",GETLat(W462))","v":""},{"$f":"IF(X462=\"\",\"\",GETLONG(X462))","v":""},"","","","",null,"",null,"",null,"",{"$f":"IF(U462=\"\", O462, MAPSYMBOL(O462, U462, $O$8))","v":""},"",null,null,null,null,null,null,null,null,null,""]
[447,{"$f":"IF(W463=\"\",\"\",GETLat(W463))","v":""},{"$f":"IF(X463=\"\",\"\",GETLONG(X463))","v":""},"","","","",null,"",null,"",null,"",{"$f":"IF(U463=\"\", O463, MAPSYMBOL(O463, U463, $O$8))","v":""},"",null,null,null,null,null,null,null,null,null,""]
[448,{"$f":"IF(W464=\"\",\"\",GETLat(W464))","v":""},{"$f":"IF(X464=\"\",\"\",GETLONG(X464))","v":""},"","","","",null,"",null,"",null,"",{"$f":"IF(U464=\"\", O464, MAPSYMBOL(O464, U464, $O$8))","v":""},"",null,null,null,null,null,null,null,null,null,""]
[449,{"$f":"IF(W465=\"\",\"\",GETLat(W465))","v":""},{"$f":"IF(X465=\"\",\"\",GETLONG(X465))","v":""},{"$f":"NamePlus($O$7, S465, T465, U465, V465)","v":""},{"$f":"IF(V465=\"\",\"\",V465)","v":""},{"$f":"IF(T465=\"\",\"\",IF($F$9 = TRUE,T465,\"\"))","v":""},{"$f":"N465","v":""},null,{"$f":"IF(S465=\"\",\"\",S465)","v":""},null,{"$f":"IF(J465<>\"\",T465,\"\")","v":""},null,{"$f":"IF(T465=\"\",\"\",T465)","v":""},{"$f":"IF(U465=\"\", O465, MAPSYMBOL(O465, U465, $O$8))","v":""},{"$f":"IF(OR(W465=\"\",X465=\"\"),\"\",VLOOKUP(T465,$M$4:$N$12,2,TRUE))","v":""},null,null,null,null,null,null,null,null,null,""]
[450,{"$f":"IF(W466=\"\",\"\",GETLat(W466))","v":""},{"$f":"IF(X466=\"\",\"\",GETLONG(X466))","v":""},"","","","",null,"",null,"",null,"",{"$f":"IF(U466=\"\", O466, MAPSYMBOL(O466, U466, $O$8))","v":""},"",null,null,null,null,null,null,null,null,null,{"$f":"IF(OR(W466=\"\",X466=\"\"),\"\",HYPERLINK(\"https://maps.google.com/maps?q=\"&B466&\",\"&C466))","v":""}]
[451,{"$f":"IF(W467=\"\",\"\",GETLat(W467))","v":""},{"$f":"IF(X467=\"\",\"\",GETLONG(X467))","v":""},"","","","",null,"",null,"",null,"",{"$f":"IF(U467=\"\", O467, MAPSYMBOL(O467, U467, $O$8))","v":""},"",null,null,null,null,null,null,null,null,null,""]
[452,{"$f":"IF(W468=\"\",\"\",GETLat(W468))","v":""},{"$f":"IF(X468=\"\",\"\",GETLONG(X468))","v":""},"","","","",null,"",null,"",null,"",{"$f":"IF(U468=\"\", O468, MAPSYMBOL(O468, U468, $O$8))","v":""},"",null,null,null,null,null,null,null,null,null,""]
[453,{"$f":"IF(W469=\"\",\"\",GETLat(W469))","v":""},{"$f":"IF(X469=\"\",\"\",GETLONG(X469))","v":""},"","","","",null,"",null,"",null,"",{"$f":"IF(U469=\"\", O469, MAPSYMBOL(O469, U469, $O$8))","v":""},"",null,null,null,null,null,null,null,null,null,""]
[454,{"$f":"IF(W470=\"\",\"\",GETLat(W470))","v":""},{"$f":"IF(X470=\"\",\"\",GETLONG(X470))","v":""},"","","","",null,"",null,"",null,"",{"$f":"IF(U470=\"\", O470, MAPSYMBOL(O470, U470, $O$8))","v":""},"",null,null,null,null,null,null,null,null,null,""]
[455,{"$f":"IF(W471=\"\",\"\",GETLat(W471))","v":""},{"$f":"IF(X471=\"\",\"\",GETLONG(X471))","v":""},"","","","",null,"",null,"",null,"",{"$f":"IF(U471=\"\", O471, MAPSYMBOL(O471, U471, $O$8))","v":""},"",null,null,null,null,null,null,null,null,null,""]
[456,{"$f":"IF(W472=\"\",\"\",GETLat(W472))","v":""},{"$f":"IF(X472=\"\",\"\",GETLONG(X472))","v":""},"","","","",null,"",null,"",null,"",{"$f":"IF(U472=\"\", O472, MAPSYMBOL(O472, U472, $O$8))","v":""},"",null,null,null,null,null,null,null,null,null,""]
[457,{"$f":"IF(W473=\"\",\"\",GETLat(W473))","v":""},{"$f":"IF(X473=\"\",\"\",GETLONG(X473))","v":""},"","","","",null,"",null,"",null,"",{"$f":"IF(U473=\"\", O473, MAPSYMBOL(O473, U473, $O$8))","v":""},"",null,null,null,null,null,null,null,null,null,""]
[458,{"$f":"IF(W474=\"\",\"\",GETLat(W474))","v":""},{"$f":"IF(X474=\"\",\"\",GETLONG(X474))","v":""},"","","","",null,"",null,"",null,"",{"$f":"IF(U474=\"\", O474, MAPSYMBOL(O474, U474, $O$8))","v":""},"",null,null,null,null,null,null,null,null,null,""]
[459,{"$f":"IF(W475=\"\",\"\",GETLat(W475))","v":""},{"$f":"IF(X475=\"\",\"\",GETLONG(X475))","v":""},"","","","",null,"",null,"",null,"",{"$f":"IF(U475=\"\", O475, MAPSYMBOL(O475, U475, $O$8))","v":""},"",null,null,null,null,null,null,null,null,null,""]
[460,{"$f":"IF(W476=\"\",\"\",GETLat(W476))","v":""},{"$f":"IF(X476=\"\",\"\",GETLONG(X476))","v":""},"","","","",null,"",null,"",null,"",{"$f":"IF(U476=\"\", O476, MAPSYMBOL(O476, U476, $O$8))","v":""},"",null,null,null,null,null,null,null,null,null,""]
[461,{"$f":"IF(W477=\"\",\"\",GETLat(W477))","v":""},{"$f":"IF(X477=\"\",\"\",GETLONG(X477))","v":""},"","","","",null,"",null,"",null,"",{"$f":"IF(U477=\"\", O477, MAPSYMBOL(O477, U477, $O$8))","v":""},"",null,null,null,null,null,null,null,null,null,""]
[462,{"$f":"IF(W478=\"\",\"\",GETLat(W478))","v":""},{"$f":"IF(X478=\"\",\"\",GETLONG(X478))","v":""},"","","","",null,"",null,"",null,"",{"$f":"IF(U478=\"\", O478, MAPSYMBOL(O478, U478, $O$8))","v":""},"",null,null,null,null,null,null,null,null,null,""]
[463,{"$f":"IF(W479=\"\",\"\",GETLat(W479))","v":""},{"$f":"IF(X479=\"\",\"\",GETLONG(X479))","v":""},"","","","",null,"",null,"",null,"",{"$f":"IF(U479=\"\", O479, MAPSYMBOL(O479, U479, $O$8))","v":""},"",null,null,null,null,null,null,null,null,null,""]
[464,{"$f":"IF(W480=\"\",\"\",GETLat(W480))","v":""},{"$f":"IF(X480=\"\",\"\",GETLONG(X480))","v":""},"","","","",null,"",null,"",null,"",{"$f":"IF(U480=\"\", O480, MAPSYMBOL(O480, U480, $O$8))","v":""},"",null,null,null,null,null,null,null,null,null,""]
[465,{"$f":"IF(W481=\"\",\"\",GETLat(W481))","v":""},{"$f":"IF(X481=\"\",\"\",GETLONG(X481))","v":""},"","","","",null,"",null,"",null,"",{"$f":"IF(U481=\"\", O481, MAPSYMBOL(O481, U481, $O$8))","v":""},"",null,null,null,null,null,null,null,null,null,""]
[466,{"$f":"IF(W482=\"\",\"\",GETLat(W482))","v":""},{"$f":"IF(X482=\"\",\"\",GETLONG(X482))","v":""},"","","","",null,"",null,"",null,"",{"$f":"IF(U482=\"\", O482, MAPSYMBOL(O482, U482, $O$8))","v":""},"",null,null,null,null,null,null,null,null,null,""]
[467,{"$f":"IF(W483=\"\",\"\",GETLat(W483))","v":""},{"$f":"IF(X483=\"\",\"\",GETLONG(X483))","v":""},"","","","",null,"",null,"",null,"",{"$f":"IF(U483=\"\", O483, MAPSYMBOL(O483, U483, $O$8))","v":""},"",null,null,null,null,null,null,null,null,null,""]
[468,{"$f":"IF(W484=\"\",\"\",GETLat(W484))","v":""},{"$f":"IF(X484=\"\",\"\",GETLONG(X484))","v":""},"","","","",null,"",null,"",null,"",{"$f":"IF(U484=\"\", O484, MAPSYMBOL(O484, U484, $O$8))","v":""},"",null,null,null,null,null,null,null,null,null,""]
[469,{"$f":"IF(W485=\"\",\"\",GETLat(W485))","v":""},{"$f":"IF(X485=\"\",\"\",GETLONG(X485))","v":""},"","","","",null,"",null,"",null,"",{"$f":"IF(U485=\"\", O485, MAPSYMBOL(O485, U485, $O$8))","v":""},"",null,null,null,null,null,null,null,null,null,""]
[470,{"$f":"IF(W486=\"\",\"\",GETLat(W486))","v":""},{"$f":"IF(X486=\"\",\"\",GETLONG(X486))","v":""},"","","","",null,"",null,"",null,"",{"$f":"IF(U486=\"\", O486, MAPSYMBOL(O486, U486, $O$8))","v":""},"",null,null,null,null,null,null,null,null,null,""]
[471,{"$f":"IF(W487=\"\",\"\",GETLat(W487))","v":""},{"$f":"IF(X487=\"\",\"\",GETLONG(X487))","v":""},"","","","",null,"",null,"",null,"",{"$f":"IF(U487=\"\", O487, MAPSYMBOL(O487, U487, $O$8))","v":""},"",null,null,null,null,null,null,null,null,null,""]
[472,{"$f":"IF(W488=\"\",\"\",GETLat(W488))","v":""},{"$f":"IF(X488=\"\",\"\",GETLONG(X488))","v":""},"","","","",null,"",null,"",null,"",{"$f":"IF(U488=\"\", O488, MAPSYMBOL(O488, U488, $O$8))","v":""},"",null,null,null,null,null,null,null,null,null,""]
[473,{"$f":"IF(W489=\"\",\"\",GETLat(W489))","v":""},{"$f":"IF(X489=\"\",\"\",GETLONG(X489))","v":""},"","","","",null,"",null,"",null,"",{"$f":"IF(U489=\"\", O489, MAPSYMBOL(O489, U489, $O$8))","v":""},"",null,null,null,null,null,null,null,null,null,""]
[474,{"$f":"IF(W490=\"\",\"\",GETLat(W490))","v":""},{"$f":"IF(X490=\"\",\"\",GETLONG(X490))","v":""},"","","","",null,"",null,"",null,"",{"$f":"IF(U490=\"\", O490, MAPSYMBOL(O490, U490, $O$8))","v":""},"",null,null,null,null,null,null,null,null,null,""]
[475,{"$f":"IF(W491=\"\",\"\",GETLat(W491))","v":""},{"$f":"IF(X491=\"\",\"\",GETLONG(X491))","v":""},"","","","",null,"",null,"",null,"",{"$f":"IF(U491=\"\", O491, MAPSYMBOL(O491, U491, $O$8))","v":""},"",null,null,null,null,null,null,null,null,null,""]
[476,{"$f":"IF(W492=\"\",\"\",GETLat(W492))","v":""},{"$f":"IF(X492=\"\",\"\",GETLONG(X492))","v":""},"","","","",null,"",null,"",null,"",{"$f":"IF(U492=\"\", O492, MAPSYMBOL(O492, U492, $O$8))","v":""},"",null,null,null,null,null,null,null,null,null,""]
[477,{"$f":"IF(W493=\"\",\"\",GETLat(W493))","v":""},{"$f":"IF(X493=\"\",\"\",GETLONG(X493))","v":""},"","","","",null,"",null,"",null,"",{"$f":"IF(U493=\"\", O493, MAPSYMBOL(O493, U493, $O$8))","v":""},"",null,null,null,null,null,null,null,null,null,""]
[478,{"$f":"IF(W494=\"\",\"\",GETLat(W494))","v":""},{"$f":"IF(X494=\"\",\"\",GETLONG(X494))","v":""},"","","","",null,"",null,"",null,"",{"$f":"IF(U494=\"\", O494, MAPSYMBOL(O494, U494, $O$8))","v":""},"",null,null,null,null,null,null,null,null,null,""]
[479,{"$f":"IF(W495=\"\",\"\",GETLat(W495))","v":""},{"$f":"IF(X495=\"\",\"\",GETLONG(X495))","v":""},"","","","",null,"",null,"",null,"",{"$f":"IF(U495=\"\", O495, MAPSYMBOL(O495, U495, $O$8))","v":""},"",null,null,null,null,null,null,null,null,null,""]
[480,{"$f":"IF(W496=\"\",\"\",GETLat(W496))","v":""},{"$f":"IF(X496=\"\",\"\",GETLONG(X496))","v":""},"","","","",null,"",null,"",null,"",{"$f":"IF(U496=\"\", O496, MAPSYMBOL(O496, U496, $O$8))","v":""},"",null,null,null,null,null,null,null,null,null,""]
[481,{"$f":"IF(W497=\"\",\"\",GETLat(W497))","v":""},{"$f":"IF(X497=\"\",\"\",GETLONG(X497))","v":""},"","","","",null,"",null,"",null,"",{"$f":"IF(U497=\"\", O497, MAPSYMBOL(O497, U497, $O$8))","v":""},"",null,null,null,null,null,null,null,null,null,""]
[482,{"$f":"IF(W498=\"\",\"\",GETLat(W498))","v":""},{"$f":"IF(X498=\"\",\"\",GETLONG(X498))","v":""},"","","","",null,"",null,"",null,"",{"$f":"IF(U498=\"\", O498, MAPSYMBOL(O498, U498, $O$8))","v":""},"",null,null,null,null,null,null,null,null,null,""]
[483,{"$f":"IF(W499=\"\",\"\",GETLat(W499))","v":""},{"$f":"IF(X499=\"\",\"\",GETLONG(X499))","v":""},"","","","",null,"",null,"",null,"",{"$f":"IF(U499=\"\", O499, MAPSYMBOL(O499, U499, $O$8))","v":""},"",null,null,null,null,null,null,null,null,null,""]
[484,{"$f":"IF(W500=\"\",\"\",GETLat(W500))","v":""},{"$f":"IF(X500=\"\",\"\",GETLONG(X500))","v":""},"","","","",null,"",null,"",null,"",{"$f":"IF(U500=\"\", O500, MAPSYMBOL(O500, U500, $O$8))","v":""},"",null,null,null,null,null,null,null,null,null,""]
[485,{"$f":"IF(W501=\"\",\"\",GETLat(W501))","v":""},{"$f":"IF(X501=\"\",\"\",GETLONG(X501))","v":""},"","","","",null,"",null,"",null,"",{"$f":"IF(U501=\"\", O501, MAPSYMBOL(O501, U501, $O$8))","v":""},"",null,null,null,null,null,null,null,null,null,""]
[486,{"$f":"IF(W502=\"\",\"\",GETLat(W502))","v":""},{"$f":"IF(X502=\"\",\"\",GETLONG(X502))","v":""},"","","","",null,"",null,"",null,"",{"$f":"IF(U502=\"\", O502, MAPSYMBOL(O502, U502, $O$8))","v":""},"",null,null,null,null,null,null,null,null,null,""]
[487,{"$f":"IF(W503=\"\",\"\",GETLat(W503))","v":""},{"$f":"IF(X503=\"\",\"\",GETLONG(X503))","v":""},"","","","",null,"",null,"",null,"",{"$f":"IF(U503=\"\", O503, MAPSYMBOL(O503, U503, $O$8))","v":""},"",null,null,null,null,null,null,null,null,null,""]
[488,{"$f":"IF(W504=\"\",\"\",GETLat(W504))","v":""},{"$f":"IF(X504=\"\",\"\",GETLONG(X504))","v":""},"","","","",null,"",null,"",null,"",{"$f":"IF(U504=\"\", O504, MAPSYMBOL(O504, U504, $O$8))","v":""},"",null,null,null,null,null,null,null,null,null,""]
[489,{"$f":"IF(W505=\"\",\"\",GETLat(W505))","v":""},{"$f":"IF(X505=\"\",\"\",GETLONG(X505))","v":""},"","","","",null,"",null,"",null,"",{"$f":"IF(U505=\"\", O505, MAPSYMBOL(O505, U505, $O$8))","v":""},"",null,null,null,null,null,null,null,null,null,""]
[490,{"$f":"IF(W506=\"\",\"\",GETLat(W506))","v":""},{"$f":"IF(X506=\"\",\"\",GETLONG(X506))","v":""},"","","","",null,"",null,"",null,"",{"$f":"IF(U506=\"\", O506, MAPSYMBOL(O506, U506, $O$8))","v":""},"",null,null,null,null,null,null,null,null,null,""]
[491,{"$f":"IF(W507=\"\",\"\",GETLat(W507))","v":""},{"$f":"IF(X507=\"\",\"\",GETLONG(X507))","v":""},"","","","",null,"",null,"",null,"",{"$f":"IF(U507=\"\", O507, MAPSYMBOL(O507, U507, $O$8))","v":""},"",null,null,null,null,null,null,null,null,null,""]
[492,{"$f":"IF(W508=\"\",\"\",GETLat(W508))","v":""},{"$f":"IF(X508=\"\",\"\",GETLONG(X508))","v":""},"","","","",null,"",null,"",null,"",{"$f":"IF(U508=\"\", O508, MAPSYMBOL(O508, U508, $O$8))","v":""},"",null,null,null,null,null,null,null,null,null,""]
[493,{"$f":"IF(W509=\"\",\"\",GETLat(W509))","v":""},{"$f":"IF(X509=\"\",\"\",GETLONG(X509))","v":""},"","","","",null,"",null,"",null,"",{"$f":"IF(U509=\"\", O509, MAPSYMBOL(O509, U509, $O$8))","v":""},"",null,null,null,null,null,null,null,null,null,""]
[494,{"$f":"IF(W510=\"\",\"\",GETLat(W510))","v":""},{"$f":"IF(X510=\"\",\"\",GETLONG(X510))","v":""},"","","","",null,"",null,"",null,"",{"$f":"IF(U510=\"\", O510, MAPSYMBOL(O510, U510, $O$8))","v":""},"",null,null,null,null,null,null,null,null,null,""]
[495,{"$f":"IF(W511=\"\",\"\",GETLat(W511))","v":""},{"$f":"IF(X511=\"\",\"\",GETLONG(X511))","v":""},"","","","",null,"",null,"",null,"",{"$f":"IF(U511=\"\", O511, MAPSYMBOL(O511, U511, $O$8))","v":""},"",null,null,null,null,null,null,null,null,null,""]
[496,{"$f":"IF(W512=\"\",\"\",GETLat(W512))","v":""},{"$f":"IF(X512=\"\",\"\",GETLONG(X512))","v":""},"","","","",null,"",null,"",null,"",{"$f":"IF(U512=\"\", O512, MAPSYMBOL(O512, U512, $O$8))","v":""},"",null,null,null,null,null,null,null,null,null,""]
[497,{"$f":"IF(W513=\"\",\"\",GETLat(W513))","v":""},{"$f":"IF(X513=\"\",\"\",GETLONG(X513))","v":""},"","","","",null,"",null,"",null,"",{"$f":"IF(U513=\"\", O513, MAPSYMBOL(O513, U513, $O$8))","v":""},"",null,null,null,null,null,null,null,null,null,""]
[498,{"$f":"IF(W514=\"\",\"\",GETLat(W514))","v":""},{"$f":"IF(X514=\"\",\"\",GETLONG(X514))","v":""},"","","","",null,"",null,"",null,"",{"$f":"IF(U514=\"\", O514, MAPSYMBOL(O514, U514, $O$8))","v":""},"",null,null,null,null,null,null,null,null,null,""]
[499,{"$f":"IF(W515=\"\",\"\",GETLat(W515))","v":""},{"$f":"IF(X515=\"\",\"\",GETLONG(X515))","v":""},"","","","",null,"",null,"",null,"",{"$f":"IF(U515=\"\", O515, MAPSYMBOL(O515, U515, $O$8))","v":""},"",null,null,null,null,null,null,null,null,null,""]
[500,{"$f":"IF(W516=\"\",\"\",GETLat(W516))","v":""},{"$f":"IF(X516=\"\",\"\",GETLONG(X516))","v":""},"","","","",null,"",null,"",null,"",{"$f":"IF(U516=\"\", O516, MAPSYMBOL(O516, U516, $O$8))","v":""},"",null,null,null,null,null,null,null,null,null,""]
[501,{"$f":"IF(W517=\"\",\"\",GETLat(W517))","v":""},{"$f":"IF(X517=\"\",\"\",GETLONG(X517))","v":""},"","","","",null,"",null,"",null,"",{"$f":"IF(U517=\"\", O517, MAPSYMBOL(O517, U517, $O$8))","v":""},"",null,null,null,null,null,null,null,null,null,""]
[502,{"$f":"IF(W518=\"\",\"\",GETLat(W518))","v":""},{"$f":"IF(X518=\"\",\"\",GETLONG(X518))","v":""},"","","","",null,"",null,"",null,"",{"$f":"IF(U518=\"\", O518, MAPSYMBOL(O518, U518, $O$8))","v":""},"",null,null,null,null,null,null,null,null,null,""]
[503,{"$f":"IF(W519=\"\",\"\",GETLat(W519))","v":""},{"$f":"IF(X519=\"\",\"\",GETLONG(X519))","v":""},"","","","",null,"",null,"",null,"",{"$f":"IF(U519=\"\", O519, MAPSYMBOL(O519, U519, $O$8))","v":""},"",null,null,null,null,null,null,null,null,null,""]
[504,{"$f":"IF(W520=\"\",\"\",GETLat(W520))","v":""},{"$f":"IF(X520=\"\",\"\",GETLONG(X520))","v":""},"","","","",null,"",null,"",null,"",{"$f":"IF(U520=\"\", O520, MAPSYMBOL(O520, U520, $O$8))","v":""},"",null,null,null,null,null,null,null,null,null,""]
[505,{"$f":"IF(W521=\"\",\"\",GETLat(W521))","v":""},{"$f":"IF(X521=\"\",\"\",GETLONG(X521))","v":""},"","","","",null,"",null,"",null,"",{"$f":"IF(U521=\"\", O521, MAPSYMBOL(O521, U521, $O$8))","v":""},"",null,null,null,null,null,null,null,null,null,""]
[506,{"$f":"IF(W522=\"\",\"\",GETLat(W522))","v":""},{"$f":"IF(X522=\"\",\"\",GETLONG(X522))","v":""},"","","","",null,"",null,"",null,"",{"$f":"IF(U522=\"\", O522, MAPSYMBOL(O522, U522, $O$8))","v":""},"",null,null,null,null,null,null,null,null,null,""]
[507,{"$f":"IF(W523=\"\",\"\",GETLat(W523))","v":""},{"$f":"IF(X523=\"\",\"\",GETLONG(X523))","v":""},"","","","",null,"",null,"",null,"",{"$f":"IF(U523=\"\", O523, MAPSYMBOL(O523, U523, $O$8))","v":""},"",null,null,null,null,null,null,null,null,null,""]
[508,{"$f":"IF(W524=\"\",\"\",GETLat(W524))","v":""},{"$f":"IF(X524=\"\",\"\",GETLONG(X524))","v":""},"","","","",null,"",null,"",null,"",{"$f":"IF(U524=\"\", O524, MAPSYMBOL(O524, U524, $O$8))","v":""},"",null,null,null,null,null,null,null,null,null,""]
[509,{"$f":"IF(W525=\"\",\"\",GETLat(W525))","v":""},{"$f":"IF(X525=\"\",\"\",GETLONG(X525))","v":""},"","","","",null,"",null,"",null,"",{"$f":"IF(U525=\"\", O525, MAPSYMBOL(O525, U525, $O$8))","v":""},"",null,null,null,null,null,null,null,null,null,""]
[510,{"$f":"IF(W526=\"\",\"\",GETLat(W526))","v":""},{"$f":"IF(X526=\"\",\"\",GETLONG(X526))","v":""},"","","","",null,"",null,"",null,"",{"$f":"IF(U526=\"\", O526, MAPSYMBOL(O526, U526, $O$8))","v":""},"",null,null,null,null,null,null,null,null,null,""]
[511,{"$f":"IF(W527=\"\",\"\",GETLat(W527))","v":""},{"$f":"IF(X527=\"\",\"\",GETLONG(X527))","v":""},"","","","",null,"",null,"",null,"",{"$f":"IF(U527=\"\", O527, MAPSYMBOL(O527, U527, $O$8))","v":""},"",null,null,null,null,null,null,null,null,null,""]
[512,{"$f":"IF(W528=\"\",\"\",GETLat(W528))","v":""},{"$f":"IF(X528=\"\",\"\",GETLONG(X528))","v":""},"","","","",null,"",null,"",null,"",{"$f":"IF(U528=\"\", O528, MAPSYMBOL(O528, U528, $O$8))","v":""},"",null,null,null,null,null,null,null,null,null,""]
[513,{"$f":"IF(W529=\"\",\"\",GETLat(W529))","v":""},{"$f":"IF(X529=\"\",\"\",GETLONG(X529))","v":""},{"$f":"NamePlus($O$7, S529, T529, U529, V529)","v":""},{"$f":"IF(V529=\"\",\"\",V529)","v":""},{"$f":"IF(T529=\"\",\"\",IF($F$9 = TRUE,T529,\"\"))","v":""},{"$f":"N529","v":""},null,{"$f":"IF(S529=\"\",\"\",S529)","v":""},null,{"$f":"IF(J529<>\"\",T529,\"\")","v":""},null,{"$f":"IF(T529=\"\",\"\",T529)","v":""},{"$f":"IF(U529=\"\", O529, MAPSYMBOL(O529, U529, $O$8))","v":""},{"$f":"IF(OR(W529=\"\",X529=\"\"),\"\",VLOOKUP(T529,$M$4:$N$12,2,TRUE))","v":""},null,null,null,null,null,null,null,null,null,""]
[514,{"$f":"IF(W530=\"\",\"\",GETLat(W530))","v":""},{"$f":"IF(X530=\"\",\"\",GETLONG(X530))","v":""},"","","","",null,"",null,"",null,"",{"$f":"IF(U530=\"\", O530, MAPSYMBOL(O530, U530, $O$8))","v":""},"",null,null,null,null,null,null,null,null,null,{"$f":"IF(OR(W530=\"\",X530=\"\"),\"\",HYPERLINK(\"https://maps.google.com/maps?q=\"&B530&\",\"&C530))","v":""}]
[515,{"$f":"IF(W531=\"\",\"\",GETLat(W531))","v":""},{"$f":"IF(X531=\"\",\"\",GETLONG(X531))","v":""},"","","","",null,"",null,"",null,"",{"$f":"IF(U531=\"\", O531, MAPSYMBOL(O531, U531, $O$8))","v":""},"",null,null,null,null,null,null,null,null,null,""]
[516,{"$f":"IF(W532=\"\",\"\",GETLat(W532))","v":""},{"$f":"IF(X532=\"\",\"\",GETLONG(X532))","v":""},"","","","",null,"",null,"",null,"",{"$f":"IF(U532=\"\", O532, MAPSYMBOL(O532, U532, $O$8))","v":""},"",null,null,null,null,null,null,null,null,null,""]
[517,{"$f":"IF(W533=\"\",\"\",GETLat(W533))","v":""},{"$f":"IF(X533=\"\",\"\",GETLONG(X533))","v":""},"","","","",null,"",null,"",null,"",{"$f":"IF(U533=\"\", O533, MAPSYMBOL(O533, U533, $O$8))","v":""},"",null,null,null,null,null,null,null,null,null,""]
[518,{"$f":"IF(W534=\"\",\"\",GETLat(W534))","v":""},{"$f":"IF(X534=\"\",\"\",GETLONG(X534))","v":""},"","","","",null,"",null,"",null,"",{"$f":"IF(U534=\"\", O534, MAPSYMBOL(O534, U534, $O$8))","v":""},"",null,null,null,null,null,null,null,null,null,""]
[519,{"$f":"IF(W535=\"\",\"\",GETLat(W535))","v":""},{"$f":"IF(X535=\"\",\"\",GETLONG(X535))","v":""},"","","","",null,"",null,"",null,"",{"$f":"IF(U535=\"\", O535, MAPSYMBOL(O535, U535, $O$8))","v":""},"",null,null,null,null,null,null,null,null,null,""]
[520,{"$f":"IF(W536=\"\",\"\",GETLat(W536))","v":""},{"$f":"IF(X536=\"\",\"\",GETLONG(X536))","v":""},"","","","",null,"",null,"",null,"",{"$f":"IF(U536=\"\", O536, MAPSYMBOL(O536, U536, $O$8))","v":""},"",null,null,null,null,null,null,null,null,null,""]
[521,{"$f":"IF(W537=\"\",\"\",GETLat(W537))","v":""},{"$f":"IF(X537=\"\",\"\",GETLONG(X537))","v":""},"","","","",null,"",null,"",null,"",{"$f":"IF(U537=\"\", O537, MAPSYMBOL(O537, U537, $O$8))","v":""},"",null,null,null,null,null,null,null,null,null,""]
[522,{"$f":"IF(W538=\"\",\"\",GETLat(W538))","v":""},{"$f":"IF(X538=\"\",\"\",GETLONG(X538))","v":""},"","","","",null,"",null,"",null,"",{"$f":"IF(U538=\"\", O538, MAPSYMBOL(O538, U538, $O$8))","v":""},"",null,null,null,null,null,null,null,null,null,""]
[523,{"$f":"IF(W539=\"\",\"\",GETLat(W539))","v":""},{"$f":"IF(X539=\"\",\"\",GETLONG(X539))","v":""},"","","","",null,"",null,"",null,"",{"$f":"IF(U539=\"\", O539, MAPSYMBOL(O539, U539, $O$8))","v":""},"",null,null,null,null,null,null,null,null,null,""]
[524,{"$f":"IF(W540=\"\",\"\",GETLat(W540))","v":""},{"$f":"IF(X540=\"\",\"\",GETLONG(X540))","v":""},"","","","",null,"",null,"",null,"",{"$f":"IF(U540=\"\", O540, MAPSYMBOL(O540, U540, $O$8))","v":""},"",null,null,null,null,null,null,null,null,null,""]
[525,{"$f":"IF(W541=\"\",\"\",GETLat(W541))","v":""},{"$f":"IF(X541=\"\",\"\",GETLONG(X541))","v":""},"","","","",null,"",null,"",null,"",{"$f":"IF(U541=\"\", O541, MAPSYMBOL(O541, U541, $O$8))","v":""},"",null,null,null,null,null,null,null,null,null,""]
[526,{"$f":"IF(W542=\"\",\"\",GETLat(W542))","v":""},{"$f":"IF(X542=\"\",\"\",GETLONG(X542))","v":""},"","","","",null,"",null,"",null,"",{"$f":"IF(U542=\"\", O542, MAPSYMBOL(O542, U542, $O$8))","v":""},"",null,null,null,null,null,null,null,null,null,""]
[527,{"$f":"IF(W543=\"\",\"\",GETLat(W543))","v":""},{"$f":"IF(X543=\"\",\"\",GETLONG(X543))","v":""},"","","","",null,"",null,"",null,"",{"$f":"IF(U543=\"\", O543, MAPSYMBOL(O543, U543, $O$8))","v":""},"",null,null,null,null,null,null,null,null,null,""]
[528,{"$f":"IF(W544=\"\",\"\",GETLat(W544))","v":""},{"$f":"IF(X544=\"\",\"\",GETLONG(X544))","v":""},"","","","",null,"",null,"",null,"",{"$f":"IF(U544=\"\", O544, MAPSYMBOL(O544, U544, $O$8))","v":""},"",null,null,null,null,null,null,null,null,null,""]
[529,{"$f":"IF(W545=\"\",\"\",GETLat(W545))","v":""},{"$f":"IF(X545=\"\",\"\",GETLONG(X545))","v":""},"","","","",null,"",null,"",null,"",{"$f":"IF(U545=\"\", O545, MAPSYMBOL(O545, U545, $O$8))","v":""},"",null,null,null,null,null,null,null,null,null,""]
[530,{"$f":"IF(W546=\"\",\"\",GETLat(W546))","v":""},{"$f":"IF(X546=\"\",\"\",GETLONG(X546))","v":""},"","","","",null,"",null,"",null,"",{"$f":"IF(U546=\"\", O546, MAPSYMBOL(O546, U546, $O$8))","v":""},"",null,null,null,null,null,null,null,null,null,""]
[531,{"$f":"IF(W547=\"\",\"\",GETLat(W547))","v":""},{"$f":"IF(X547=\"\",\"\",GETLONG(X547))","v":""},"","","","",null,"",null,"",null,"",{"$f":"IF(U547=\"\", O547, MAPSYMBOL(O547, U547, $O$8))","v":""},"",null,null,null,null,null,null,null,null,null,""]
[532,{"$f":"IF(W548=\"\",\"\",GETLat(W548))","v":""},{"$f":"IF(X548=\"\",\"\",GETLONG(X548))","v":""},"","","","",null,"",null,"",null,"",{"$f":"IF(U548=\"\", O548, MAPSYMBOL(O548, U548, $O$8))","v":""},"",null,null,null,null,null,null,null,null,null,""]
[533,{"$f":"IF(W549=\"\",\"\",GETLat(W549))","v":""},{"$f":"IF(X549=\"\",\"\",GETLONG(X549))","v":""},"","","","",null,"",null,"",null,"",{"$f":"IF(U549=\"\", O549, MAPSYMBOL(O549, U549, $O$8))","v":""},"",null,null,null,null,null,null,null,null,null,""]
[534,{"$f":"IF(W550=\"\",\"\",GETLat(W550))","v":""},{"$f":"IF(X550=\"\",\"\",GETLONG(X550))","v":""},"","","","",null,"",null,"",null,"",{"$f":"IF(U550=\"\", O550, MAPSYMBOL(O550, U550, $O$8))","v":""},"",null,null,null,null,null,null,null,null,null,""]
[535,{"$f":"IF(W551=\"\",\"\",GETLat(W551))","v":""},{"$f":"IF(X551=\"\",\"\",GETLONG(X551))","v":""},"","","","",null,"",null,"",null,"",{"$f":"IF(U551=\"\", O551, MAPSYMBOL(O551, U551, $O$8))","v":""},"",null,null,null,null,null,null,null,null,null,""]
[536,{"$f":"IF(W552=\"\",\"\",GETLat(W552))","v":""},{"$f":"IF(X552=\"\",\"\",GETLONG(X552))","v":""},"","","","",null,"",null,"",null,"",{"$f":"IF(U552=\"\", O552, MAPSYMBOL(O552, U552, $O$8))","v":""},"",null,null,null,null,null,null,null,null,null,""]
[537,{"$f":"IF(W553=\"\",\"\",GETLat(W553))","v":""},{"$f":"IF(X553=\"\",\"\",GETLONG(X553))","v":""},"","","","",null,"",null,"",null,"",{"$f":"IF(U553=\"\", O553, MAPSYMBOL(O553, U553, $O$8))","v":""},"",null,null,null,null,null,null,null,null,null,""]
[538,{"$f":"IF(W554=\"\",\"\",GETLat(W554))","v":""},{"$f":"IF(X554=\"\",\"\",GETLONG(X554))","v":""},"","","","",null,"",null,"",null,"",{"$f":"IF(U554=\"\", O554, MAPSYMBOL(O554, U554, $O$8))","v":""},"",null,null,null,null,null,null,null,null,null,""]
[539,{"$f":"IF(W555=\"\",\"\",GETLat(W555))","v":""},{"$f":"IF(X555=\"\",\"\",GETLONG(X555))","v":""},"","","","",null,"",null,"",null,"",{"$f":"IF(U555=\"\", O555, MAPSYMBOL(O555, U555, $O$8))","v":""},"",null,null,null,null,null,null,null,null,null,""]
[540,{"$f":"IF(W556=\"\",\"\",GETLat(W556))","v":""},{"$f":"IF(X556=\"\",\"\",GETLONG(X556))","v":""},"","","","",null,"",null,"",null,"",{"$f":"IF(U556=\"\", O556, MAPSYMBOL(O556, U556, $O$8))","v":""},"",null,null,null,null,null,null,null,null,null,""]
[541,{"$f":"IF(W557=\"\",\"\",GETLat(W557))","v":""},{"$f":"IF(X557=\"\",\"\",GETLONG(X557))","v":""},"","","","",null,"",null,"",null,"",{"$f":"IF(U557=\"\", O557, MAPSYMBOL(O557, U557, $O$8))","v":""},"",null,null,null,null,null,null,null,null,null,""]
[542,{"$f":"IF(W558=\"\",\"\",GETLat(W558))","v":""},{"$f":"IF(X558=\"\",\"\",GETLONG(X558))","v":""},"","","","",null,"",null,"",null,"",{"$f":"IF(U558=\"\", O558, MAPSYMBOL(O558, U558, $O$8))","v":""},"",null,null,null,null,null,null,null,null,null,""]
[543,{"$f":"IF(W559=\"\",\"\",GETLat(W559))","v":""},{"$f":"IF(X559=\"\",\"\",GETLONG(X559))","v":""},"","","","",null,"",null,"",null,"",{"$f":"IF(U559=\"\", O559, MAPSYMBOL(O559, U559, $O$8))","v":""},"",null,null,null,null,null,null,null,null,null,""]
[544,{"$f":"IF(W560=\"\",\"\",GETLat(W560))","v":""},{"$f":"IF(X560=\"\",\"\",GETLONG(X560))","v":""},"","","","",null,"",null,"",null,"",{"$f":"IF(U560=\"\", O560, MAPSYMBOL(O560, U560, $O$8))","v":""},"",null,null,null,null,null,null,null,null,null,""]
[545,{"$f":"IF(W561=\"\",\"\",GETLat(W561))","v":""},{"$f":"IF(X561=\"\",\"\",GETLONG(X561))","v":""},"","","","",null,"",null,"",null,"",{"$f":"IF(U561=\"\", O561, MAPSYMBOL(O561, U561, $O$8))","v":""},"",null,null,null,null,null,null,null,null,null,""]
[546,{"$f":"IF(W562=\"\",\"\",GETLat(W562))","v":""},{"$f":"IF(X562=\"\",\"\",GETLONG(X562))","v":""},"","","","",null,"",null,"",null,"",{"$f":"IF(U562=\"\", O562, MAPSYMBOL(O562, U562, $O$8))","v":""},"",null,null,null,null,null,null,null,null,null,""]
[547,{"$f":"IF(W563=\"\",\"\",GETLat(W563))","v":""},{"$f":"IF(X563=\"\",\"\",GETLONG(X563))","v":""},"","","","",null,"",null,"",null,"",{"$f":"IF(U563=\"\", O563, MAPSYMBOL(O563, U563, $O$8))","v":""},"",null,null,null,null,null,null,null,null,null,""]
[548,{"$f":"IF(W564=\"\",\"\",GETLat(W564))","v":""},{"$f":"IF(X564=\"\",\"\",GETLONG(X564))","v":""},"","","","",null,"",null,"",null,"",{"$f":"IF(U564=\"\", O564, MAPSYMBOL(O564, U564, $O$8))","v":""},"",null,null,null,null,null,null,null,null,null,""]
[549,{"$f":"IF(W565=\"\",\"\",GETLat(W565))","v":""},{"$f":"IF(X565=\"\",\"\",GETLONG(X565))","v":""},"","","","",null,"",null,"",null,"",{"$f":"IF(U565=\"\", O565, MAPSYMBOL(O565, U565, $O$8))","v":""},"",null,null,null,null,null,null,null,null,null,""]
[550,{"$f":"IF(W566=\"\",\"\",GETLat(W566))","v":""},{"$f":"IF(X566=\"\",\"\",GETLONG(X566))","v":""},"","","","",null,"",null,"",null,"",{"$f":"IF(U566=\"\", O566, MAPSYMBOL(O566, U566, $O$8))","v":""},"",null,null,null,null,null,null,null,null,null,""]
[551,{"$f":"IF(W567=\"\",\"\",GETLat(W567))","v":""},{"$f":"IF(X567=\"\",\"\",GETLONG(X567))","v":""},"","","","",null,"",null,"",null,"",{"$f":"IF(U567=\"\", O567, MAPSYMBOL(O567, U567, $O$8))","v":""},"",null,null,null,null,null,null,null,null,null,""]
[552,{"$f":"IF(W568=\"\",\"\",GETLat(W568))","v":""},{"$f":"IF(X568=\"\",\"\",GETLONG(X568))","v":""},"","","","",null,"",null,"",null,"",{"$f":"IF(U568=\"\", O568, MAPSYMBOL(O568, U568, $O$8))","v":""},"",null,null,null,null,null,null,null,null,null,""]
[553,{"$f":"IF(W569=\"\",\"\",GETLat(W569))","v":""},{"$f":"IF(X569=\"\",\"\",GETLONG(X569))","v":""},"","","","",null,"",null,"",null,"",{"$f":"IF(U569=\"\", O569, MAPSYMBOL(O569, U569, $O$8))","v":""},"",null,null,null,null,null,null,null,null,null,""]
[554,{"$f":"IF(W570=\"\",\"\",GETLat(W570))","v":""},{"$f":"IF(X570=\"\",\"\",GETLONG(X570))","v":""},"","","","",null,"",null,"",null,"",{"$f":"IF(U570=\"\", O570, MAPSYMBOL(O570, U570, $O$8))","v":""},"",null,null,null,null,null,null,null,null,null,""]
[555,{"$f":"IF(W571=\"\",\"\",GETLat(W571))","v":""},{"$f":"IF(X571=\"\",\"\",GETLONG(X571))","v":""},"","","","",null,"",null,"",null,"",{"$f":"IF(U571=\"\", O571, MAPSYMBOL(O571, U571, $O$8))","v":""},"",null,null,null,null,null,null,null,null,null,""]
[556,{"$f":"IF(W572=\"\",\"\",GETLat(W572))","v":""},{"$f":"IF(X572=\"\",\"\",GETLONG(X572))","v":""},"","","","",null,"",null,"",null,"",{"$f":"IF(U572=\"\", O572, MAPSYMBOL(O572, U572, $O$8))","v":""},"",null,null,null,null,null,null,null,null,null,""]
[557,{"$f":"IF(W573=\"\",\"\",GETLat(W573))","v":""},{"$f":"IF(X573=\"\",\"\",GETLONG(X573))","v":""},"","","","",null,"",null,"",null,"",{"$f":"IF(U573=\"\", O573, MAPSYMBOL(O573, U573, $O$8))","v":""},"",null,null,null,null,null,null,null,null,null,""]
[558,{"$f":"IF(W574=\"\",\"\",GETLat(W574))","v":""},{"$f":"IF(X574=\"\",\"\",GETLONG(X574))","v":""},"","","","",null,"",null,"",null,"",{"$f":"IF(U574=\"\", O574, MAPSYMBOL(O574, U574, $O$8))","v":""},"",null,null,null,null,null,null,null,null,null,""]
[559,{"$f":"IF(W575=\"\",\"\",GETLat(W575))","v":""},{"$f":"IF(X575=\"\",\"\",GETLONG(X575))","v":""},"","","","",null,"",null,"",null,"",{"$f":"IF(U575=\"\", O575, MAPSYMBOL(O575, U575, $O$8))","v":""},"",null,null,null,null,null,null,null,null,null,""]
[560,{"$f":"IF(W576=\"\",\"\",GETLat(W576))","v":""},{"$f":"IF(X576=\"\",\"\",GETLONG(X576))","v":""},"","","","",null,"",null,"",null,"",{"$f":"IF(U576=\"\", O576, MAPSYMBOL(O576, U576, $O$8))","v":""},"",null,null,null,null,null,null,null,null,null,""]
[561,{"$f":"IF(W577=\"\",\"\",GETLat(W577))","v":""},{"$f":"IF(X577=\"\",\"\",GETLONG(X577))","v":""},"","","","",null,"",null,"",null,"",{"$f":"IF(U577=\"\", O577, MAPSYMBOL(O577, U577, $O$8))","v":""},"",null,null,null,null,null,null,null,null,null,""]
[562,{"$f":"IF(W578=\"\",\"\",GETLat(W578))","v":""},{"$f":"IF(X578=\"\",\"\",GETLONG(X578))","v":""},"","","","",null,"",null,"",null,"",{"$f":"IF(U578=\"\", O578, MAPSYMBOL(O578, U578, $O$8))","v":""},"",null,null,null,null,null,null,null,null,null,""]
[563,{"$f":"IF(W579=\"\",\"\",GETLat(W579))","v":""},{"$f":"IF(X579=\"\",\"\",GETLONG(X579))","v":""},"","","","",null,"",null,"",null,"",{"$f":"IF(U579=\"\", O579, MAPSYMBOL(O579, U579, $O$8))","v":""},"",null,null,null,null,null,null,null,null,null,""]
[564,{"$f":"IF(W580=\"\",\"\",GETLat(W580))","v":""},{"$f":"IF(X580=\"\",\"\",GETLONG(X580))","v":""},"","","","",null,"",null,"",null,"",{"$f":"IF(U580=\"\", O580, MAPSYMBOL(O580, U580, $O$8))","v":""},"",null,null,null,null,null,null,null,null,null,""]
[565,{"$f":"IF(W581=\"\",\"\",GETLat(W581))","v":""},{"$f":"IF(X581=\"\",\"\",GETLONG(X581))","v":""},"","","","",null,"",null,"",null,"",{"$f":"IF(U581=\"\", O581, MAPSYMBOL(O581, U581, $O$8))","v":""},"",null,null,null,null,null,null,null,null,null,""]
[566,{"$f":"IF(W582=\"\",\"\",GETLat(W582))","v":""},{"$f":"IF(X582=\"\",\"\",GETLONG(X582))","v":""},"","","","",null,"",null,"",null,"",{"$f":"IF(U582=\"\", O582, MAPSYMBOL(O582, U582, $O$8))","v":""},"",null,null,null,null,null,null,null,null,null,""]
[567,{"$f":"IF(W583=\"\",\"\",GETLat(W583))","v":""},{"$f":"IF(X583=\"\",\"\",GETLONG(X583))","v":""},"","","","",null,"",null,"",null,"",{"$f":"IF(U583=\"\", O583, MAPSYMBOL(O583, U583, $O$8))","v":""},"",null,null,null,null,null,null,null,null,null,""]
[568,{"$f":"IF(W584=\"\",\"\",GETLat(W584))","v":""},{"$f":"IF(X584=\"\",\"\",GETLONG(X584))","v":""},"","","","",null,"",null,"",null,"",{"$f":"IF(U584=\"\", O584, MAPSYMBOL(O584, U584, $O$8))","v":""},"",null,null,null,null,null,null,null,null,null,""]
[569,{"$f":"IF(W585=\"\",\"\",GETLat(W585))","v":""},{"$f":"IF(X585=\"\",\"\",GETLONG(X585))","v":""},"","","","",null,"",null,"",null,"",{"$f":"IF(U585=\"\", O585, MAPSYMBOL(O585, U585, $O$8))","v":""},"",null,null,null,null,null,null,null,null,null,""]
[570,{"$f":"IF(W586=\"\",\"\",GETLat(W586))","v":""},{"$f":"IF(X586=\"\",\"\",GETLONG(X586))","v":""},"","","","",null,"",null,"",null,"",{"$f":"IF(U586=\"\", O586, MAPSYMBOL(O586, U586, $O$8))","v":""},"",null,null,null,null,null,null,null,null,null,""]
[571,{"$f":"IF(W587=\"\",\"\",GETLat(W587))","v":""},{"$f":"IF(X587=\"\",\"\",GETLONG(X587))","v":""},"","","","",null,"",null,"",null,"",{"$f":"IF(U587=\"\", O587, MAPSYMBOL(O587, U587, $O$8))","v":""},"",null,null,null,null,null,null,null,null,null,""]
[572,{"$f":"IF(W588=\"\",\"\",GETLat(W588))","v":""},{"$f":"IF(X588=\"\",\"\",GETLONG(X588))","v":""},"","","","",null,"",null,"",null,"",{"$f":"IF(U588=\"\", O588, MAPSYMBOL(O588, U588, $O$8))","v":""},"",null,null,null,null,null,null,null,null,null,""]
[573,{"$f":"IF(W589=\"\",\"\",GETLat(W589))","v":""},{"$f":"IF(X589=\"\",\"\",GETLONG(X589))","v":""},"","","","",null,"",null,"",null,"",{"$f":"IF(U589=\"\", O589, MAPSYMBOL(O589, U589, $O$8))","v":""},"",null,null,null,null,null,null,null,null,null,""]
[574,{"$f":"IF(W590=\"\",\"\",GETLat(W590))","v":""},{"$f":"IF(X590=\"\",\"\",GETLONG(X590))","v":""},"","","","",null,"",null,"",null,"",{"$f":"IF(U590=\"\", O590, MAPSYMBOL(O590, U590, $O$8))","v":""},"",null,null,null,null,null,null,null,null,null,""]
[575,{"$f":"IF(W591=\"\",\"\",GETLat(W591))","v":""},{"$f":"IF(X591=\"\",\"\",GETLONG(X591))","v":""},"","","","",null,"",null,"",null,"",{"$f":"IF(U591=\"\", O591, MAPSYMBOL(O591, U591, $O$8))","v":""},"",null,null,null,null,null,null,null,null,null,""]
[576,{"$f":"IF(W592=\"\",\"\",GETLat(W592))","v":""},{"$f":"IF(X592=\"\",\"\",GETLONG(X592))","v":""},"","","","",null,"",null,"",null,"",{"$f":"IF(U592=\"\", O592, MAPSYMBOL(O592, U592, $O$8))","v":""},"",null,null,null,null,null,null,null,null,null,""]
[577,{"$f":"IF(W593=\"\",\"\",GETLat(W593))","v":""},{"$f":"IF(X593=\"\",\"\",GETLONG(X593))","v":""},{"$f":"NamePlus($O$7, S593, T593, U593, V593)","v":""},{"$f":"IF(V593=\"\",\"\",V593)","v":""},{"$f":"IF(T593=\"\",\"\",IF($F$9 = TRUE,T593,\"\"))","v":""},{"$f":"N593","v":""},null,{"$f":"IF(S593=\"\",\"\",S593)","v":""},null,{"$f":"IF(J593<>\"\",T593,\"\")","v":""},null,{"$f":"IF(T593=\"\",\"\",T593)","v":""},{"$f":"IF(U593=\"\", O593, MAPSYMBOL(O593, U593, $O$8))","v":""},{"$f":"IF(OR(W593=\"\",X593=\"\"),\"\",VLOOKUP(T593,$M$4:$N$12,2,TRUE))","v":""},null,null,null,null,null,null,null,null,null,""]
[578,{"$f":"IF(W594=\"\",\"\",GETLat(W594))","v":""},{"$f":"IF(X594=\"\",\"\",GETLONG(X594))","v":""},"","","","",null,"",null,"",null,"",{"$f":"IF(U594=\"\", O594, MAPSYMBOL(O594, U594, $O$8))","v":""},"",null,null,null,null,null,null,null,null,null,{"$f":"IF(OR(W594=\"\",X594=\"\"),\"\",HYPERLINK(\"https://maps.google.com/maps?q=\"&B594&\",\"&C594))","v":""}]
[579,{"$f":"IF(W595=\"\",\"\",GETLat(W595))","v":""},{"$f":"IF(X595=\"\",\"\",GETLONG(X595))","v":""},"","","","",null,"",null,"",null,"",{"$f":"IF(U595=\"\", O595, MAPSYMBOL(O595, U595, $O$8))","v":""},"",null,null,null,null,null,null,null,null,null,""]
[580,{"$f":"IF(W596=\"\",\"\",GETLat(W596))","v":""},{"$f":"IF(X596=\"\",\"\",GETLONG(X596))","v":""},"","","","",null,"",null,"",null,"",{"$f":"IF(U596=\"\", O596, MAPSYMBOL(O596, U596, $O$8))","v":""},"",null,null,null,null,null,null,null,null,null,""]
[581,{"$f":"IF(W597=\"\",\"\",GETLat(W597))","v":""},{"$f":"IF(X597=\"\",\"\",GETLONG(X597))","v":""},"","","","",null,"",null,"",null,"",{"$f":"IF(U597=\"\", O597, MAPSYMBOL(O597, U597, $O$8))","v":""},"",null,null,null,null,null,null,null,null,null,""]
[582,{"$f":"IF(W598=\"\",\"\",GETLat(W598))","v":""},{"$f":"IF(X598=\"\",\"\",GETLONG(X598))","v":""},"","","","",null,"",null,"",null,"",{"$f":"IF(U598=\"\", O598, MAPSYMBOL(O598, U598, $O$8))","v":""},"",null,null,null,null,null,null,null,null,null,""]
[583,{"$f":"IF(W599=\"\",\"\",GETLat(W599))","v":""},{"$f":"IF(X599=\"\",\"\",GETLONG(X599))","v":""},"","","","",null,"",null,"",null,"",{"$f":"IF(U599=\"\", O599, MAPSYMBOL(O599, U599, $O$8))","v":""},"",null,null,null,null,null,null,null,null,null,""]
[584,{"$f":"IF(W600=\"\",\"\",GETLat(W600))","v":""},{"$f":"IF(X600=\"\",\"\",GETLONG(X600))","v":""},"","","","",null,"",null,"",null,"",{"$f":"IF(U600=\"\", O600, MAPSYMBOL(O600, U600, $O$8))","v":""},"",null,null,null,null,null,null,null,null,null,""]
[585,{"$f":"IF(W601=\"\",\"\",GETLat(W601))","v":""},{"$f":"IF(X601=\"\",\"\",GETLONG(X601))","v":""},"","","","",null,"",null,"",null,"",{"$f":"IF(U601=\"\", O601, MAPSYMBOL(O601, U601, $O$8))","v":""},"",null,null,null,null,null,null,null,null,null,""]
[586,{"$f":"IF(W602=\"\",\"\",GETLat(W602))","v":""},{"$f":"IF(X602=\"\",\"\",GETLONG(X602))","v":""},"","","","",null,"",null,"",null,"",{"$f":"IF(U602=\"\", O602, MAPSYMBOL(O602, U602, $O$8))","v":""},"",null,null,null,null,null,null,null,null,null,""]
[587,{"$f":"IF(W603=\"\",\"\",GETLat(W603))","v":""},{"$f":"IF(X603=\"\",\"\",GETLONG(X603))","v":""},"","","","",null,"",null,"",null,"",{"$f":"IF(U603=\"\", O603, MAPSYMBOL(O603, U603, $O$8))","v":""},"",null,null,null,null,null,null,null,null,null,""]
[588,{"$f":"IF(W604=\"\",\"\",GETLat(W604))","v":""},{"$f":"IF(X604=\"\",\"\",GETLONG(X604))","v":""},"","","","",null,"",null,"",null,"",{"$f":"IF(U604=\"\", O604, MAPSYMBOL(O604, U604, $O$8))","v":""},"",null,null,null,null,null,null,null,null,null,""]
[589,{"$f":"IF(W605=\"\",\"\",GETLat(W605))","v":""},{"$f":"IF(X605=\"\",\"\",GETLONG(X605))","v":""},"","","","",null,"",null,"",null,"",{"$f":"IF(U605=\"\", O605, MAPSYMBOL(O605, U605, $O$8))","v":""},"",null,null,null,null,null,null,null,null,null,""]
[590,{"$f":"IF(W606=\"\",\"\",GETLat(W606))","v":""},{"$f":"IF(X606=\"\",\"\",GETLONG(X606))","v":""},"","","","",null,"",null,"",null,"",{"$f":"IF(U606=\"\", O606, MAPSYMBOL(O606, U606, $O$8))","v":""},"",null,null,null,null,null,null,null,null,null,""]
[591,{"$f":"IF(W607=\"\",\"\",GETLat(W607))","v":""},{"$f":"IF(X607=\"\",\"\",GETLONG(X607))","v":""},"","","","",null,"",null,"",null,"",{"$f":"IF(U607=\"\", O607, MAPSYMBOL(O607, U607, $O$8))","v":""},"",null,null,null,null,null,null,null,null,null,""]
[592,{"$f":"IF(W608=\"\",\"\",GETLat(W608))","v":""},{"$f":"IF(X608=\"\",\"\",GETLONG(X608))","v":""},"","","","",null,"",null,"",null,"",{"$f":"IF(U608=\"\", O608, MAPSYMBOL(O608, U608, $O$8))","v":""},"",null,null,null,null,null,null,null,null,null,""]
[593,{"$f":"IF(W609=\"\",\"\",GETLat(W609))","v":""},{"$f":"IF(X609=\"\",\"\",GETLONG(X609))","v":""},"","","","",null,"",null,"",null,"",{"$f":"IF(U609=\"\", O609, MAPSYMBOL(O609, U609, $O$8))","v":""},"",null,null,null,null,null,null,null,null,null,""]
[594,{"$f":"IF(W610=\"\",\"\",GETLat(W610))","v":""},{"$f":"IF(X610=\"\",\"\",GETLONG(X610))","v":""},"","","","",null,"",null,"",null,"",{"$f":"IF(U610=\"\", O610, MAPSYMBOL(O610, U610, $O$8))","v":""},"",null,null,null,null,null,null,null,null,null,""]
[595,{"$f":"IF(W611=\"\",\"\",GETLat(W611))","v":""},{"$f":"IF(X611=\"\",\"\",GETLONG(X611))","v":""},"","","","",null,"",null,"",null,"",{"$f":"IF(U611=\"\", O611, MAPSYMBOL(O611, U611, $O$8))","v":""},"",null,null,null,null,null,null,null,null,null,""]
[596,{"$f":"IF(W612=\"\",\"\",GETLat(W612))","v":""},{"$f":"IF(X612=\"\",\"\",GETLONG(X612))","v":""},"","","","",null,"",null,"",null,"",{"$f":"IF(U612=\"\", O612, MAPSYMBOL(O612, U612, $O$8))","v":""},"",null,null,null,null,null,null,null,null,null,""]
[597,{"$f":"IF(W613=\"\",\"\",GETLat(W613))","v":""},{"$f":"IF(X613=\"\",\"\",GETLONG(X613))","v":""},"","","","",null,"",null,"",null,"",{"$f":"IF(U613=\"\", O613, MAPSYMBOL(O613, U613, $O$8))","v":""},"",null,null,null,null,null,null,null,null,null,""]
[598,{"$f":"IF(W614=\"\",\"\",GETLat(W614))","v":""},{"$f":"IF(X614=\"\",\"\",GETLONG(X614))","v":""},"","","","",null,"",null,"",null,"",{"$f":"IF(U614=\"\", O614, MAPSYMBOL(O614, U614, $O$8))","v":""},"",null,null,null,null,null,null,null,null,null,""]
[599,{"$f":"IF(W615=\"\",\"\",GETLat(W615))","v":""},{"$f":"IF(X615=\"\",\"\",GETLONG(X615))","v":""},"","","","",null,"",null,"",null,"",{"$f":"IF(U615=\"\", O615, MAPSYMBOL(O615, U615, $O$8))","v":""},"",null,null,null,null,null,null,null,null,null,""]
[600,{"$f":"IF(W616=\"\",\"\",GETLat(W616))","v":""},{"$f":"IF(X616=\"\",\"\",GETLONG(X616))","v":""},"","","","",null,"",null,"",null,"",{"$f":"IF(U616=\"\", O616, MAPSYMBOL(O616, U616, $O$8))","v":""},"",null,null,null,null,null,null,null,null,null,""]
[601,{"$f":"IF(W617=\"\",\"\",GETLat(W617))","v":""},{"$f":"IF(X617=\"\",\"\",GETLONG(X617))","v":""},"","","","",null,"",null,"",null,"",{"$f":"IF(U617=\"\", O617, MAPSYMBOL(O617, U617, $O$8))","v":""},"",null,null,null,null,null,null,null,null,null,""]
[602,{"$f":"IF(W618=\"\",\"\",GETLat(W618))","v":""},{"$f":"IF(X618=\"\",\"\",GETLONG(X618))","v":""},"","","","",null,"",null,"",null,"",{"$f":"IF(U618=\"\", O618, MAPSYMBOL(O618, U618, $O$8))","v":""},"",null,null,null,null,null,null,null,null,null,""]
[603,{"$f":"IF(W619=\"\",\"\",GETLat(W619))","v":""},{"$f":"IF(X619=\"\",\"\",GETLONG(X619))","v":""},"","","","",null,"",null,"",null,"",{"$f":"IF(U619=\"\", O619, MAPSYMBOL(O619, U619, $O$8))","v":""},"",null,null,null,null,null,null,null,null,null,""]
[604,{"$f":"IF(W620=\"\",\"\",GETLat(W620))","v":""},{"$f":"IF(X620=\"\",\"\",GETLONG(X620))","v":""},"","","","",null,"",null,"",null,"",{"$f":"IF(U620=\"\", O620, MAPSYMBOL(O620, U620, $O$8))","v":""},"",null,null,null,null,null,null,null,null,null,""]
[605,{"$f":"IF(W621=\"\",\"\",GETLat(W621))","v":""},{"$f":"IF(X621=\"\",\"\",GETLONG(X621))","v":""},"","","","",null,"",null,"",null,"",{"$f":"IF(U621=\"\", O621, MAPSYMBOL(O621, U621, $O$8))","v":""},"",null,null,null,null,null,null,null,null,null,""]
[606,{"$f":"IF(W622=\"\",\"\",GETLat(W622))","v":""},{"$f":"IF(X622=\"\",\"\",GETLONG(X622))","v":""},"","","","",null,"",null,"",null,"",{"$f":"IF(U622=\"\", O622, MAPSYMBOL(O622, U622, $O$8))","v":""},"",null,null,null,null,null,null,null,null,null,""]
[607,{"$f":"IF(W623=\"\",\"\",GETLat(W623))","v":""},{"$f":"IF(X623=\"\",\"\",GETLONG(X623))","v":""},"","","","",null,"",null,"",null,"",{"$f":"IF(U623=\"\", O623, MAPSYMBOL(O623, U623, $O$8))","v":""},"",null,null,null,null,null,null,null,null,null,""]
[608,{"$f":"IF(W624=\"\",\"\",GETLat(W624))","v":""},{"$f":"IF(X624=\"\",\"\",GETLONG(X624))","v":""},"","","","",null,"",null,"",null,"",{"$f":"IF(U624=\"\", O624, MAPSYMBOL(O624, U624, $O$8))","v":""},"",null,null,null,null,null,null,null,null,null,""]
[609,{"$f":"IF(W625=\"\",\"\",GETLat(W625))","v":""},{"$f":"IF(X625=\"\",\"\",GETLONG(X625))","v":""},"","","","",null,"",null,"",null,"",{"$f":"IF(U625=\"\", O625, MAPSYMBOL(O625, U625, $O$8))","v":""},"",null,null,null,null,null,null,null,null,null,""]
[610,{"$f":"IF(W626=\"\",\"\",GETLat(W626))","v":""},{"$f":"IF(X626=\"\",\"\",GETLONG(X626))","v":""},"","","","",null,"",null,"",null,"",{"$f":"IF(U626=\"\", O626, MAPSYMBOL(O626, U626, $O$8))","v":""},"",null,null,null,null,null,null,null,null,null,""]
[611,{"$f":"IF(W627=\"\",\"\",GETLat(W627))","v":""},{"$f":"IF(X627=\"\",\"\",GETLONG(X627))","v":""},"","","","",null,"",null,"",null,"",{"$f":"IF(U627=\"\", O627, MAPSYMBOL(O627, U627, $O$8))","v":""},"",null,null,null,null,null,null,null,null,null,""]
[612,{"$f":"IF(W628=\"\",\"\",GETLat(W628))","v":""},{"$f":"IF(X628=\"\",\"\",GETLONG(X628))","v":""},"","","","",null,"",null,"",null,"",{"$f":"IF(U628=\"\", O628, MAPSYMBOL(O628, U628, $O$8))","v":""},"",null,null,null,null,null,null,null,null,null,""]
[613,{"$f":"IF(W629=\"\",\"\",GETLat(W629))","v":""},{"$f":"IF(X629=\"\",\"\",GETLONG(X629))","v":""},"","","","",null,"",null,"",null,"",{"$f":"IF(U629=\"\", O629, MAPSYMBOL(O629, U629, $O$8))","v":""},"",null,null,null,null,null,null,null,null,null,""]
[614,{"$f":"IF(W630=\"\",\"\",GETLat(W630))","v":""},{"$f":"IF(X630=\"\",\"\",GETLONG(X630))","v":""},"","","","",null,"",null,"",null,"",{"$f":"IF(U630=\"\", O630, MAPSYMBOL(O630, U630, $O$8))","v":""},"",null,null,null,null,null,null,null,null,null,""]
[615,{"$f":"IF(W631=\"\",\"\",GETLat(W631))","v":""},{"$f":"IF(X631=\"\",\"\",GETLONG(X631))","v":""},"","","","",null,"",null,"",null,"",{"$f":"IF(U631=\"\", O631, MAPSYMBOL(O631, U631, $O$8))","v":""},"",null,null,null,null,null,null,null,null,null,""]
[616,{"$f":"IF(W632=\"\",\"\",GETLat(W632))","v":""},{"$f":"IF(X632=\"\",\"\",GETLONG(X632))","v":""},"","","","",null,"",null,"",null,"",{"$f":"IF(U632=\"\", O632, MAPSYMBOL(O632, U632, $O$8))","v":""},"",null,null,null,null,null,null,null,null,null,""]
[617,{"$f":"IF(W633=\"\",\"\",GETLat(W633))","v":""},{"$f":"IF(X633=\"\",\"\",GETLONG(X633))","v":""},"","","","",null,"",null,"",null,"",{"$f":"IF(U633=\"\", O633, MAPSYMBOL(O633, U633, $O$8))","v":""},"",null,null,null,null,null,null,null,null,null,""]
[618,{"$f":"IF(W634=\"\",\"\",GETLat(W634))","v":""},{"$f":"IF(X634=\"\",\"\",GETLONG(X634))","v":""},"","","","",null,"",null,"",null,"",{"$f":"IF(U634=\"\", O634, MAPSYMBOL(O634, U634, $O$8))","v":""},"",null,null,null,null,null,null,null,null,null,""]
[619,{"$f":"IF(W635=\"\",\"\",GETLat(W635))","v":""},{"$f":"IF(X635=\"\",\"\",GETLONG(X635))","v":""},"","","","",null,"",null,"",null,"",{"$f":"IF(U635=\"\", O635, MAPSYMBOL(O635, U635, $O$8))","v":""},"",null,null,null,null,null,null,null,null,null,""]
[620,{"$f":"IF(W636=\"\",\"\",GETLat(W636))","v":""},{"$f":"IF(X636=\"\",\"\",GETLONG(X636))","v":""},"","","","",null,"",null,"",null,"",{"$f":"IF(U636=\"\", O636, MAPSYMBOL(O636, U636, $O$8))","v":""},"",null,null,null,null,null,null,null,null,null,""]
[621,{"$f":"IF(W637=\"\",\"\",GETLat(W637))","v":""},{"$f":"IF(X637=\"\",\"\",GETLONG(X637))","v":""},"","","","",null,"",null,"",null,"",{"$f":"IF(U637=\"\", O637, MAPSYMBOL(O637, U637, $O$8))","v":""},"",null,null,null,null,null,null,null,null,null,""]
[622,{"$f":"IF(W638=\"\",\"\",GETLat(W638))","v":""},{"$f":"IF(X638=\"\",\"\",GETLONG(X638))","v":""},"","","","",null,"",null,"",null,"",{"$f":"IF(U638=\"\", O638, MAPSYMBOL(O638, U638, $O$8))","v":""},"",null,null,null,null,null,null,null,null,null,""]
[623,{"$f":"IF(W639=\"\",\"\",GETLat(W639))","v":""},{"$f":"IF(X639=\"\",\"\",GETLONG(X639))","v":""},"","","","",null,"",null,"",null,"",{"$f":"IF(U639=\"\", O639, MAPSYMBOL(O639, U639, $O$8))","v":""},"",null,null,null,null,null,null,null,null,null,""]
[624,{"$f":"IF(W640=\"\",\"\",GETLat(W640))","v":""},{"$f":"IF(X640=\"\",\"\",GETLONG(X640))","v":""},"","","","",null,"",null,"",null,"",{"$f":"IF(U640=\"\", O640, MAPSYMBOL(O640, U640, $O$8))","v":""},"",null,null,null,null,null,null,null,null,null,""]
[625,{"$f":"IF(W641=\"\",\"\",GETLat(W641))","v":""},{"$f":"IF(X641=\"\",\"\",GETLONG(X641))","v":""},"","","","",null,"",null,"",null,"",{"$f":"IF(U641=\"\", O641, MAPSYMBOL(O641, U641, $O$8))","v":""},"",null,null,null,null,null,null,null,null,null,""]
[626,{"$f":"IF(W642=\"\",\"\",GETLat(W642))","v":""},{"$f":"IF(X642=\"\",\"\",GETLONG(X642))","v":""},"","","","",null,"",null,"",null,"",{"$f":"IF(U642=\"\", O642, MAPSYMBOL(O642, U642, $O$8))","v":""},"",null,null,null,null,null,null,null,null,null,""]
[627,{"$f":"IF(W643=\"\",\"\",GETLat(W643))","v":""},{"$f":"IF(X643=\"\",\"\",GETLONG(X643))","v":""},"","","","",null,"",null,"",null,"",{"$f":"IF(U643=\"\", O643, MAPSYMBOL(O643, U643, $O$8))","v":""},"",null,null,null,null,null,null,null,null,null,""]
[628,{"$f":"IF(W644=\"\",\"\",GETLat(W644))","v":""},{"$f":"IF(X644=\"\",\"\",GETLONG(X644))","v":""},"","","","",null,"",null,"",null,"",{"$f":"IF(U644=\"\", O644, MAPSYMBOL(O644, U644, $O$8))","v":""},"",null,null,null,null,null,null,null,null,null,""]
[629,{"$f":"IF(W645=\"\",\"\",GETLat(W645))","v":""},{"$f":"IF(X645=\"\",\"\",GETLONG(X645))","v":""},"","","","",null,"",null,"",null,"",{"$f":"IF(U645=\"\", O645, MAPSYMBOL(O645, U645, $O$8))","v":""},"",null,null,null,null,null,null,null,null,null,""]
[630,{"$f":"IF(W646=\"\",\"\",GETLat(W646))","v":""},{"$f":"IF(X646=\"\",\"\",GETLONG(X646))","v":""},"","","","",null,"",null,"",null,"",{"$f":"IF(U646=\"\", O646, MAPSYMBOL(O646, U646, $O$8))","v":""},"",null,null,null,null,null,null,null,null,null,""]
[631,{"$f":"IF(W647=\"\",\"\",GETLat(W647))","v":""},{"$f":"IF(X647=\"\",\"\",GETLONG(X647))","v":""},"","","","",null,"",null,"",null,"",{"$f":"IF(U647=\"\", O647, MAPSYMBOL(O647, U647, $O$8))","v":""},"",null,null,null,null,null,null,null,null,null,""]
[632,{"$f":"IF(W648=\"\",\"\",GETLat(W648))","v":""},{"$f":"IF(X648=\"\",\"\",GETLONG(X648))","v":""},"","","","",null,"",null,"",null,"",{"$f":"IF(U648=\"\", O648, MAPSYMBOL(O648, U648, $O$8))","v":""},"",null,null,null,null,null,null,null,null,null,""]
[633,{"$f":"IF(W649=\"\",\"\",GETLat(W649))","v":""},{"$f":"IF(X649=\"\",\"\",GETLONG(X649))","v":""},"","","","",null,"",null,"",null,"",{"$f":"IF(U649=\"\", O649, MAPSYMBOL(O649, U649, $O$8))","v":""},"",null,null,null,null,null,null,null,null,null,""]
[634,{"$f":"IF(W650=\"\",\"\",GETLat(W650))","v":""},{"$f":"IF(X650=\"\",\"\",GETLONG(X650))","v":""},"","","","",null,"",null,"",null,"",{"$f":"IF(U650=\"\", O650, MAPSYMBOL(O650, U650, $O$8))","v":""},"",null,null,null,null,null,null,null,null,null,""]
[635,{"$f":"IF(W651=\"\",\"\",GETLat(W651))","v":""},{"$f":"IF(X651=\"\",\"\",GETLONG(X651))","v":""},"","","","",null,"",null,"",null,"",{"$f":"IF(U651=\"\", O651, MAPSYMBOL(O651, U651, $O$8))","v":""},"",null,null,null,null,null,null,null,null,null,""]
[636,{"$f":"IF(W652=\"\",\"\",GETLat(W652))","v":""},{"$f":"IF(X652=\"\",\"\",GETLONG(X652))","v":""},"","","","",null,"",null,"",null,"",{"$f":"IF(U652=\"\", O652, MAPSYMBOL(O652, U652, $O$8))","v":""},"",null,null,null,null,null,null,null,null,null,""]
[637,{"$f":"IF(W653=\"\",\"\",GETLat(W653))","v":""},{"$f":"IF(X653=\"\",\"\",GETLONG(X653))","v":""},"","","","",null,"",null,"",null,"",{"$f":"IF(U653=\"\", O653, MAPSYMBOL(O653, U653, $O$8))","v":""},"",null,null,null,null,null,null,null,null,null,""]
[638,{"$f":"IF(W654=\"\",\"\",GETLat(W654))","v":""},{"$f":"IF(X654=\"\",\"\",GETLONG(X654))","v":""},"","","","",null,"",null,"",null,"",{"$f":"IF(U654=\"\", O654, MAPSYMBOL(O654, U654, $O$8))","v":""},"",null,null,null,null,null,null,null,null,null,""]
[639,{"$f":"IF(W655=\"\",\"\",GETLat(W655))","v":""},{"$f":"IF(X655=\"\",\"\",GETLONG(X655))","v":""},"","","","",null,"",null,"",null,"",{"$f":"IF(U655=\"\", O655, MAPSYMBOL(O655, U655, $O$8))","v":""},"",null,null,null,null,null,null,null,null,null,""]
[640,{"$f":"IF(W656=\"\",\"\",GETLat(W656))","v":""},{"$f":"IF(X656=\"\",\"\",GETLONG(X656))","v":""},"","","","",null,"",null,"",null,"",{"$f":"IF(U656=\"\", O656, MAPSYMBOL(O656, U656, $O$8))","v":""},"",null,null,null,null,null,null,null,null,null,""]
[641,{"$f":"IF(W657=\"\",\"\",GETLat(W657))","v":""},{"$f":"IF(X657=\"\",\"\",GETLONG(X657))","v":""},{"$f":"NamePlus($O$7, S657, T657, U657, V657)","v":""},{"$f":"IF(V657=\"\",\"\",V657)","v":""},{"$f":"IF(T657=\"\",\"\",IF($F$9 = TRUE,T657,\"\"))","v":""},{"$f":"N657","v":""},null,{"$f":"IF(S657=\"\",\"\",S657)","v":""},null,{"$f":"IF(J657<>\"\",T657,\"\")","v":""},null,{"$f":"IF(T657=\"\",\"\",T657)","v":""},{"$f":"IF(U657=\"\", O657, MAPSYMBOL(O657, U657, $O$8))","v":""},{"$f":"IF(OR(W657=\"\",X657=\"\"),\"\",VLOOKUP(T657,$M$4:$N$12,2,TRUE))","v":""},null,null,null,null,null,null,null,null,null,""]
[642,{"$f":"IF(W658=\"\",\"\",GETLat(W658))","v":""},{"$f":"IF(X658=\"\",\"\",GETLONG(X658))","v":""},"","","","",null,"",null,"",null,"",{"$f":"IF(U658=\"\", O658, MAPSYMBOL(O658, U658, $O$8))","v":""},"",null,null,null,null,null,null,null,null,null,{"$f":"IF(OR(W658=\"\",X658=\"\"),\"\",HYPERLINK(\"https://maps.google.com/maps?q=\"&B658&\",\"&C658))","v":""}]
[643,{"$f":"IF(W659=\"\",\"\",GETLat(W659))","v":""},{"$f":"IF(X659=\"\",\"\",GETLONG(X659))","v":""},"","","","",null,"",null,"",null,"",{"$f":"IF(U659=\"\", O659, MAPSYMBOL(O659, U659, $O$8))","v":""},"",null,null,null,null,null,null,null,null,null,""]
[644,{"$f":"IF(W660=\"\",\"\",GETLat(W660))","v":""},{"$f":"IF(X660=\"\",\"\",GETLONG(X660))","v":""},"","","","",null,"",null,"",null,"",{"$f":"IF(U660=\"\", O660, MAPSYMBOL(O660, U660, $O$8))","v":""},"",null,null,null,null,null,null,null,null,null,""]
[645,{"$f":"IF(W661=\"\",\"\",GETLat(W661))","v":""},{"$f":"IF(X661=\"\",\"\",GETLONG(X661))","v":""},"","","","",null,"",null,"",null,"",{"$f":"IF(U661=\"\", O661, MAPSYMBOL(O661, U661, $O$8))","v":""},"",null,null,null,null,null,null,null,null,null,""]
[646,{"$f":"IF(W662=\"\",\"\",GETLat(W662))","v":""},{"$f":"IF(X662=\"\",\"\",GETLONG(X662))","v":""},"","","","",null,"",null,"",null,"",{"$f":"IF(U662=\"\", O662, MAPSYMBOL(O662, U662, $O$8))","v":""},"",null,null,null,null,null,null,null,null,null,""]
[647,{"$f":"IF(W663=\"\",\"\",GETLat(W663))","v":""},{"$f":"IF(X663=\"\",\"\",GETLONG(X663))","v":""},"","","","",null,"",null,"",null,"",{"$f":"IF(U663=\"\", O663, MAPSYMBOL(O663, U663, $O$8))","v":""},"",null,null,null,null,null,null,null,null,null,""]
[648,{"$f":"IF(W664=\"\",\"\",GETLat(W664))","v":""},{"$f":"IF(X664=\"\",\"\",GETLONG(X664))","v":""},"","","","",null,"",null,"",null,"",{"$f":"IF(U664=\"\", O664, MAPSYMBOL(O664, U664, $O$8))","v":""},"",null,null,null,null,null,null,null,null,null,""]
[649,{"$f":"IF(W665=\"\",\"\",GETLat(W665))","v":""},{"$f":"IF(X665=\"\",\"\",GETLONG(X665))","v":""},"","","","",null,"",null,"",null,"",{"$f":"IF(U665=\"\", O665, MAPSYMBOL(O665, U665, $O$8))","v":""},"",null,null,null,null,null,null,null,null,null,""]
[650,{"$f":"IF(W666=\"\",\"\",GETLat(W666))","v":""},{"$f":"IF(X666=\"\",\"\",GETLONG(X666))","v":""},"","","","",null,"",null,"",null,"",{"$f":"IF(U666=\"\", O666, MAPSYMBOL(O666, U666, $O$8))","v":""},"",null,null,null,null,null,null,null,null,null,""]
[651,{"$f":"IF(W667=\"\",\"\",GETLat(W667))","v":""},{"$f":"IF(X667=\"\",\"\",GETLONG(X667))","v":""},"","","","",null,"",null,"",null,"",{"$f":"IF(U667=\"\", O667, MAPSYMBOL(O667, U667, $O$8))","v":""},"",null,null,null,null,null,null,null,null,null,""]
[652,{"$f":"IF(W668=\"\",\"\",GETLat(W668))","v":""},{"$f":"IF(X668=\"\",\"\",GETLONG(X668))","v":""},"","","","",null,"",null,"",null,"",{"$f":"IF(U668=\"\", O668, MAPSYMBOL(O668, U668, $O$8))","v":""},"",null,null,null,null,null,null,null,null,null,""]
[653,{"$f":"IF(W669=\"\",\"\",GETLat(W669))","v":""},{"$f":"IF(X669=\"\",\"\",GETLONG(X669))","v":""},"","","","",null,"",null,"",null,"",{"$f":"IF(U669=\"\", O669, MAPSYMBOL(O669, U669, $O$8))","v":""},"",null,null,null,null,null,null,null,null,null,""]
[654,{"$f":"IF(W670=\"\",\"\",GETLat(W670))","v":""},{"$f":"IF(X670=\"\",\"\",GETLONG(X670))","v":""},"","","","",null,"",null,"",null,"",{"$f":"IF(U670=\"\", O670, MAPSYMBOL(O670, U670, $O$8))","v":""},"",null,null,null,null,null,null,null,null,null,""]
[655,{"$f":"IF(W671=\"\",\"\",GETLat(W671))","v":""},{"$f":"IF(X671=\"\",\"\",GETLONG(X671))","v":""},"","","","",null,"",null,"",null,"",{"$f":"IF(U671=\"\", O671, MAPSYMBOL(O671, U671, $O$8))","v":""},"",null,null,null,null,null,null,null,null,null,""]
[656,{"$f":"IF(W672=\"\",\"\",GETLat(W672))","v":""},{"$f":"IF(X672=\"\",\"\",GETLONG(X672))","v":""},"","","","",null,"",null,"",null,"",{"$f":"IF(U672=\"\", O672, MAPSYMBOL(O672, U672, $O$8))","v":""},"",null,null,null,null,null,null,null,null,null,""]
[657,{"$f":"IF(W673=\"\",\"\",GETLat(W673))","v":""},{"$f":"IF(X673=\"\",\"\",GETLONG(X673))","v":""},"","","","",null,"",null,"",null,"",{"$f":"IF(U673=\"\", O673, MAPSYMBOL(O673, U673, $O$8))","v":""},"",null,null,null,null,null,null,null,null,null,""]
[658,{"$f":"IF(W674=\"\",\"\",GETLat(W674))","v":""},{"$f":"IF(X674=\"\",\"\",GETLONG(X674))","v":""},"","","","",null,"",null,"",null,"",{"$f":"IF(U674=\"\", O674, MAPSYMBOL(O674, U674, $O$8))","v":""},"",null,null,null,null,null,null,null,null,null,""]
[659,{"$f":"IF(W675=\"\",\"\",GETLat(W675))","v":""},{"$f":"IF(X675=\"\",\"\",GETLONG(X675))","v":""},"","","","",null,"",null,"",null,"",{"$f":"IF(U675=\"\", O675, MAPSYMBOL(O675, U675, $O$8))","v":""},"",null,null,null,null,null,null,null,null,null,""]
[660,{"$f":"IF(W676=\"\",\"\",GETLat(W676))","v":""},{"$f":"IF(X676=\"\",\"\",GETLONG(X676))","v":""},"","","","",null,"",null,"",null,"",{"$f":"IF(U676=\"\", O676, MAPSYMBOL(O676, U676, $O$8))","v":""},"",null,null,null,null,null,null,null,null,null,""]
[661,{"$f":"IF(W677=\"\",\"\",GETLat(W677))","v":""},{"$f":"IF(X677=\"\",\"\",GETLONG(X677))","v":""},"","","","",null,"",null,"",null,"",{"$f":"IF(U677=\"\", O677, MAPSYMBOL(O677, U677, $O$8))","v":""},"",null,null,null,null,null,null,null,null,null,""]
[662,{"$f":"IF(W678=\"\",\"\",GETLat(W678))","v":""},{"$f":"IF(X678=\"\",\"\",GETLONG(X678))","v":""},"","","","",null,"",null,"",null,"",{"$f":"IF(U678=\"\", O678, MAPSYMBOL(O678, U678, $O$8))","v":""},"",null,null,null,null,null,null,null,null,null,""]
[663,{"$f":"IF(W679=\"\",\"\",GETLat(W679))","v":""},{"$f":"IF(X679=\"\",\"\",GETLONG(X679))","v":""},"","","","",null,"",null,"",null,"",{"$f":"IF(U679=\"\", O679, MAPSYMBOL(O679, U679, $O$8))","v":""},"",null,null,null,null,null,null,null,null,null,""]
[664,{"$f":"IF(W680=\"\",\"\",GETLat(W680))","v":""},{"$f":"IF(X680=\"\",\"\",GETLONG(X680))","v":""},"","","","",null,"",null,"",null,"",{"$f":"IF(U680=\"\", O680, MAPSYMBOL(O680, U680, $O$8))","v":""},"",null,null,null,null,null,null,null,null,null,""]
[665,{"$f":"IF(W681=\"\",\"\",GETLat(W681))","v":""},{"$f":"IF(X681=\"\",\"\",GETLONG(X681))","v":""},"","","","",null,"",null,"",null,"",{"$f":"IF(U681=\"\", O681, MAPSYMBOL(O681, U681, $O$8))","v":""},"",null,null,null,null,null,null,null,null,null,""]
[666,{"$f":"IF(W682=\"\",\"\",GETLat(W682))","v":""},{"$f":"IF(X682=\"\",\"\",GETLONG(X682))","v":""},"","","","",null,"",null,"",null,"",{"$f":"IF(U682=\"\", O682, MAPSYMBOL(O682, U682, $O$8))","v":""},"",null,null,null,null,null,null,null,null,null,""]
[667,{"$f":"IF(W683=\"\",\"\",GETLat(W683))","v":""},{"$f":"IF(X683=\"\",\"\",GETLONG(X683))","v":""},"","","","",null,"",null,"",null,"",{"$f":"IF(U683=\"\", O683, MAPSYMBOL(O683, U683, $O$8))","v":""},"",null,null,null,null,null,null,null,null,null,""]
[668,{"$f":"IF(W684=\"\",\"\",GETLat(W684))","v":""},{"$f":"IF(X684=\"\",\"\",GETLONG(X684))","v":""},"","","","",null,"",null,"",null,"",{"$f":"IF(U684=\"\", O684, MAPSYMBOL(O684, U684, $O$8))","v":""},"",null,null,null,null,null,null,null,null,null,""]
[669,{"$f":"IF(W685=\"\",\"\",GETLat(W685))","v":""},{"$f":"IF(X685=\"\",\"\",GETLONG(X685))","v":""},"","","","",null,"",null,"",null,"",{"$f":"IF(U685=\"\", O685, MAPSYMBOL(O685, U685, $O$8))","v":""},"",null,null,null,null,null,null,null,null,null,""]
[670,{"$f":"IF(W686=\"\",\"\",GETLat(W686))","v":""},{"$f":"IF(X686=\"\",\"\",GETLONG(X686))","v":""},"","","","",null,"",null,"",null,"",{"$f":"IF(U686=\"\", O686, MAPSYMBOL(O686, U686, $O$8))","v":""},"",null,null,null,null,null,null,null,null,null,""]
[671,{"$f":"IF(W687=\"\",\"\",GETLat(W687))","v":""},{"$f":"IF(X687=\"\",\"\",GETLONG(X687))","v":""},"","","","",null,"",null,"",null,"",{"$f":"IF(U687=\"\", O687, MAPSYMBOL(O687, U687, $O$8))","v":""},"",null,null,null,null,null,null,null,null,null,""]
[672,{"$f":"IF(W688=\"\",\"\",GETLat(W688))","v":""},{"$f":"IF(X688=\"\",\"\",GETLONG(X688))","v":""},"","","","",null,"",null,"",null,"",{"$f":"IF(U688=\"\", O688, MAPSYMBOL(O688, U688, $O$8))","v":""},"",null,null,null,null,null,null,null,null,null,""]
[673,{"$f":"IF(W689=\"\",\"\",GETLat(W689))","v":""},{"$f":"IF(X689=\"\",\"\",GETLONG(X689))","v":""},"","","","",null,"",null,"",null,"",{"$f":"IF(U689=\"\", O689, MAPSYMBOL(O689, U689, $O$8))","v":""},"",null,null,null,null,null,null,null,null,null,""]
[674,{"$f":"IF(W690=\"\",\"\",GETLat(W690))","v":""},{"$f":"IF(X690=\"\",\"\",GETLONG(X690))","v":""},"","","","",null,"",null,"",null,"",{"$f":"IF(U690=\"\", O690, MAPSYMBOL(O690, U690, $O$8))","v":""},"",null,null,null,null,null,null,null,null,null,""]
[675,{"$f":"IF(W691=\"\",\"\",GETLat(W691))","v":""},{"$f":"IF(X691=\"\",\"\",GETLONG(X691))","v":""},"","","","",null,"",null,"",null,"",{"$f":"IF(U691=\"\", O691, MAPSYMBOL(O691, U691, $O$8))","v":""},"",null,null,null,null,null,null,null,null,null,""]
[676,{"$f":"IF(W692=\"\",\"\",GETLat(W692))","v":""},{"$f":"IF(X692=\"\",\"\",GETLONG(X692))","v":""},"","","","",null,"",null,"",null,"",{"$f":"IF(U692=\"\", O692, MAPSYMBOL(O692, U692, $O$8))","v":""},"",null,null,null,null,null,null,null,null,null,""]
[677,{"$f":"IF(W693=\"\",\"\",GETLat(W693))","v":""},{"$f":"IF(X693=\"\",\"\",GETLONG(X693))","v":""},"","","","",null,"",null,"",null,"",{"$f":"IF(U693=\"\", O693, MAPSYMBOL(O693, U693, $O$8))","v":""},"",null,null,null,null,null,null,null,null,null,""]
[678,{"$f":"IF(W694=\"\",\"\",GETLat(W694))","v":""},{"$f":"IF(X694=\"\",\"\",GETLONG(X694))","v":""},"","","","",null,"",null,"",null,"",{"$f":"IF(U694=\"\", O694, MAPSYMBOL(O694, U694, $O$8))","v":""},"",null,null,null,null,null,null,null,null,null,""]
[679,{"$f":"IF(W695=\"\",\"\",GETLat(W695))","v":""},{"$f":"IF(X695=\"\",\"\",GETLONG(X695))","v":""},"","","","",null,"",null,"",null,"",{"$f":"IF(U695=\"\", O695, MAPSYMBOL(O695, U695, $O$8))","v":""},"",null,null,null,null,null,null,null,null,null,""]
[680,{"$f":"IF(W696=\"\",\"\",GETLat(W696))","v":""},{"$f":"IF(X696=\"\",\"\",GETLONG(X696))","v":""},"","","","",null,"",null,"",null,"",{"$f":"IF(U696=\"\", O696, MAPSYMBOL(O696, U696, $O$8))","v":""},"",null,null,null,null,null,null,null,null,null,""]
[681,{"$f":"IF(W697=\"\",\"\",GETLat(W697))","v":""},{"$f":"IF(X697=\"\",\"\",GETLONG(X697))","v":""},"","","","",null,"",null,"",null,"",{"$f":"IF(U697=\"\", O697, MAPSYMBOL(O697, U697, $O$8))","v":""},"",null,null,null,null,null,null,null,null,null,""]
[682,{"$f":"IF(W698=\"\",\"\",GETLat(W698))","v":""},{"$f":"IF(X698=\"\",\"\",GETLONG(X698))","v":""},"","","","",null,"",null,"",null,"",{"$f":"IF(U698=\"\", O698, MAPSYMBOL(O698, U698, $O$8))","v":""},"",null,null,null,null,null,null,null,null,null,""]
[683,{"$f":"IF(W699=\"\",\"\",GETLat(W699))","v":""},{"$f":"IF(X699=\"\",\"\",GETLONG(X699))","v":""},"","","","",null,"",null,"",null,"",{"$f":"IF(U699=\"\", O699, MAPSYMBOL(O699, U699, $O$8))","v":""},"",null,null,null,null,null,null,null,null,null,""]
[684,{"$f":"IF(W700=\"\",\"\",GETLat(W700))","v":""},{"$f":"IF(X700=\"\",\"\",GETLONG(X700))","v":""},"","","","",null,"",null,"",null,"",{"$f":"IF(U700=\"\", O700, MAPSYMBOL(O700, U700, $O$8))","v":""},"",null,null,null,null,null,null,null,null,null,""]
[685,{"$f":"IF(W701=\"\",\"\",GETLat(W701))","v":""},{"$f":"IF(X701=\"\",\"\",GETLONG(X701))","v":""},"","","","",null,"",null,"",null,"",{"$f":"IF(U701=\"\", O701, MAPSYMBOL(O701, U701, $O$8))","v":""},"",null,null,null,null,null,null,null,null,null,""]
[686,{"$f":"IF(W702=\"\",\"\",GETLat(W702))","v":""},{"$f":"IF(X702=\"\",\"\",GETLONG(X702))","v":""},"","","","",null,"",null,"",null,"",{"$f":"IF(U702=\"\", O702, MAPSYMBOL(O702, U702, $O$8))","v":""},"",null,null,null,null,null,null,null,null,null,""]
[687,{"$f":"IF(W703=\"\",\"\",GETLat(W703))","v":""},{"$f":"IF(X703=\"\",\"\",GETLONG(X703))","v":""},"","","","",null,"",null,"",null,"",{"$f":"IF(U703=\"\", O703, MAPSYMBOL(O703, U703, $O$8))","v":""},"",null,null,null,null,null,null,null,null,null,""]
[688,{"$f":"IF(W704=\"\",\"\",GETLat(W704))","v":""},{"$f":"IF(X704=\"\",\"\",GETLONG(X704))","v":""},"","","","",null,"",null,"",null,"",{"$f":"IF(U704=\"\", O704, MAPSYMBOL(O704, U704, $O$8))","v":""},"",null,null,null,null,null,null,null,null,null,""]
[689,{"$f":"IF(W705=\"\",\"\",GETLat(W705))","v":""},{"$f":"IF(X705=\"\",\"\",GETLONG(X705))","v":""},"","","","",null,"",null,"",null,"",{"$f":"IF(U705=\"\", O705, MAPSYMBOL(O705, U705, $O$8))","v":""},"",null,null,null,null,null,null,null,null,null,""]
[690,{"$f":"IF(W706=\"\",\"\",GETLat(W706))","v":""},{"$f":"IF(X706=\"\",\"\",GETLONG(X706))","v":""},"","","","",null,"",null,"",null,"",{"$f":"IF(U706=\"\", O706, MAPSYMBOL(O706, U706, $O$8))","v":""},"",null,null,null,null,null,null,null,null,null,""]
[691,{"$f":"IF(W707=\"\",\"\",GETLat(W707))","v":""},{"$f":"IF(X707=\"\",\"\",GETLONG(X707))","v":""},"","","","",null,"",null,"",null,"",{"$f":"IF(U707=\"\", O707, MAPSYMBOL(O707, U707, $O$8))","v":""},"",null,null,null,null,null,null,null,null,null,""]
[692,{"$f":"IF(W708=\"\",\"\",GETLat(W708))","v":""},{"$f":"IF(X708=\"\",\"\",GETLONG(X708))","v":""},"","","","",null,"",null,"",null,"",{"$f":"IF(U708=\"\", O708, MAPSYMBOL(O708, U708, $O$8))","v":""},"",null,null,null,null,null,null,null,null,null,""]
[693,{"$f":"IF(W709=\"\",\"\",GETLat(W709))","v":""},{"$f":"IF(X709=\"\",\"\",GETLONG(X709))","v":""},"","","","",null,"",null,"",null,"",{"$f":"IF(U709=\"\", O709, MAPSYMBOL(O709, U709, $O$8))","v":""},"",null,null,null,null,null,null,null,null,null,""]
[694,{"$f":"IF(W710=\"\",\"\",GETLat(W710))","v":""},{"$f":"IF(X710=\"\",\"\",GETLONG(X710))","v":""},"","","","",null,"",null,"",null,"",{"$f":"IF(U710=\"\", O710, MAPSYMBOL(O710, U710, $O$8))","v":""},"",null,null,null,null,null,null,null,null,null,""]
[695,{"$f":"IF(W711=\"\",\"\",GETLat(W711))","v":""},{"$f":"IF(X711=\"\",\"\",GETLONG(X711))","v":""},"","","","",null,"",null,"",null,"",{"$f":"IF(U711=\"\", O711, MAPSYMBOL(O711, U711, $O$8))","v":""},"",null,null,null,null,null,null,null,null,null,""]
[696,{"$f":"IF(W712=\"\",\"\",GETLat(W712))","v":""},{"$f":"IF(X712=\"\",\"\",GETLONG(X712))","v":""},"","","","",null,"",null,"",null,"",{"$f":"IF(U712=\"\", O712, MAPSYMBOL(O712, U712, $O$8))","v":""},"",null,null,null,null,null,null,null,null,null,""]
[697,{"$f":"IF(W713=\"\",\"\",GETLat(W713))","v":""},{"$f":"IF(X713=\"\",\"\",GETLONG(X713))","v":""},"","","","",null,"",null,"",null,"",{"$f":"IF(U713=\"\", O713, MAPSYMBOL(O713, U713, $O$8))","v":""},"",null,null,null,null,null,null,null,null,null,""]
[698,{"$f":"IF(W714=\"\",\"\",GETLat(W714))","v":""},{"$f":"IF(X714=\"\",\"\",GETLONG(X714))","v":""},"","","","",null,"",null,"",null,"",{"$f":"IF(U714=\"\", O714, MAPSYMBOL(O714, U714, $O$8))","v":""},"",null,null,null,null,null,null,null,null,null,""]
[699,{"$f":"IF(W715=\"\",\"\",GETLat(W715))","v":""},{"$f":"IF(X715=\"\",\"\",GETLONG(X715))","v":""},"","","","",null,"",null,"",null,"",{"$f":"IF(U715=\"\", O715, MAPSYMBOL(O715, U715, $O$8))","v":""},"",null,null,null,null,null,null,null,null,null,""]
[700,{"$f":"IF(W716=\"\",\"\",GETLat(W716))","v":""},{"$f":"IF(X716=\"\",\"\",GETLONG(X716))","v":""},"","","","",null,"",null,"",null,"",{"$f":"IF(U716=\"\", O716, MAPSYMBOL(O716, U716, $O$8))","v":""},"",null,null,null,null,null,null,null,null,null,""]
[701,{"$f":"IF(W717=\"\",\"\",GETLat(W717))","v":""},{"$f":"IF(X717=\"\",\"\",GETLONG(X717))","v":""},"","","","",null,"",null,"",null,"",{"$f":"IF(U717=\"\", O717, MAPSYMBOL(O717, U717, $O$8))","v":""},"",null,null,null,null,null,null,null,null,null,""]
[702,{"$f":"IF(W718=\"\",\"\",GETLat(W718))","v":""},{"$f":"IF(X718=\"\",\"\",GETLONG(X718))","v":""},"","","","",null,"",null,"",null,"",{"$f":"IF(U718=\"\", O718, MAPSYMBOL(O718, U718, $O$8))","v":""},"",null,null,null,null,null,null,null,null,null,""]
[703,{"$f":"IF(W719=\"\",\"\",GETLat(W719))","v":""},{"$f":"IF(X719=\"\",\"\",GETLONG(X719))","v":""},"","","","",null,"",null,"",null,"",{"$f":"IF(U719=\"\", O719, MAPSYMBOL(O719, U719, $O$8))","v":""},"",null,null,null,null,null,null,null,null,null,""]
[704,{"$f":"IF(W720=\"\",\"\",GETLat(W720))","v":""},{"$f":"IF(X720=\"\",\"\",GETLONG(X720))","v":""},"","","","",null,"",null,"",null,"",{"$f":"IF(U720=\"\", O720, MAPSYMBOL(O720, U720, $O$8))","v":""},"",null,null,null,null,null,null,null,null,null,""]
[705,{"$f":"IF(W721=\"\",\"\",GETLat(W721))","v":""},{"$f":"IF(X721=\"\",\"\",GETLONG(X721))","v":""},{"$f":"NamePlus($O$7, S721, T721, U721, V721)","v":""},{"$f":"IF(V721=\"\",\"\",V721)","v":""},{"$f":"IF(T721=\"\",\"\",IF($F$9 = TRUE,T721,\"\"))","v":""},{"$f":"N721","v":""},null,{"$f":"IF(S721=\"\",\"\",S721)","v":""},null,{"$f":"IF(J721<>\"\",T721,\"\")","v":""},null,{"$f":"IF(T721=\"\",\"\",T721)","v":""},{"$f":"IF(U721=\"\", O721, MAPSYMBOL(O721, U721, $O$8))","v":""},{"$f":"IF(OR(W721=\"\",X721=\"\"),\"\",VLOOKUP(T721,$M$4:$N$12,2,TRUE))","v":""},null,null,null,null,null,null,null,null,null,""]
[706,{"$f":"IF(W722=\"\",\"\",GETLat(W722))","v":""},{"$f":"IF(X722=\"\",\"\",GETLONG(X722))","v":""},"","","","",null,"",null,"",null,"",{"$f":"IF(U722=\"\", O722, MAPSYMBOL(O722, U722, $O$8))","v":""},"",null,null,null,null,null,null,null,null,null,{"$f":"IF(OR(W722=\"\",X722=\"\"),\"\",HYPERLINK(\"https://maps.google.com/maps?q=\"&B722&\",\"&C722))","v":""}]
[707,{"$f":"IF(W723=\"\",\"\",GETLat(W723))","v":""},{"$f":"IF(X723=\"\",\"\",GETLONG(X723))","v":""},"","","","",null,"",null,"",null,"",{"$f":"IF(U723=\"\", O723, MAPSYMBOL(O723, U723, $O$8))","v":""},"",null,null,null,null,null,null,null,null,null,""]
[708,{"$f":"IF(W724=\"\",\"\",GETLat(W724))","v":""},{"$f":"IF(X724=\"\",\"\",GETLONG(X724))","v":""},"","","","",null,"",null,"",null,"",{"$f":"IF(U724=\"\", O724, MAPSYMBOL(O724, U724, $O$8))","v":""},"",null,null,null,null,null,null,null,null,null,""]
[709,{"$f":"IF(W725=\"\",\"\",GETLat(W725))","v":""},{"$f":"IF(X725=\"\",\"\",GETLONG(X725))","v":""},"","","","",null,"",null,"",null,"",{"$f":"IF(U725=\"\", O725, MAPSYMBOL(O725, U725, $O$8))","v":""},"",null,null,null,null,null,null,null,null,null,""]
[710,{"$f":"IF(W726=\"\",\"\",GETLat(W726))","v":""},{"$f":"IF(X726=\"\",\"\",GETLONG(X726))","v":""},"","","","",null,"",null,"",null,"",{"$f":"IF(U726=\"\", O726, MAPSYMBOL(O726, U726, $O$8))","v":""},"",null,null,null,null,null,null,null,null,null,""]
[711,{"$f":"IF(W727=\"\",\"\",GETLat(W727))","v":""},{"$f":"IF(X727=\"\",\"\",GETLONG(X727))","v":""},"","","","",null,"",null,"",null,"",{"$f":"IF(U727=\"\", O727, MAPSYMBOL(O727, U727, $O$8))","v":""},"",null,null,null,null,null,null,null,null,null,""]
[712,{"$f":"IF(W728=\"\",\"\",GETLat(W728))","v":""},{"$f":"IF(X728=\"\",\"\",GETLONG(X728))","v":""},"","","","",null,"",null,"",null,"",{"$f":"IF(U728=\"\", O728, MAPSYMBOL(O728, U728, $O$8))","v":""},"",null,null,null,null,null,null,null,null,null,""]
[713,{"$f":"IF(W729=\"\",\"\",GETLat(W729))","v":""},{"$f":"IF(X729=\"\",\"\",GETLONG(X729))","v":""},"","","","",null,"",null,"",null,"",{"$f":"IF(U729=\"\", O729, MAPSYMBOL(O729, U729, $O$8))","v":""},"",null,null,null,null,null,null,null,null,null,""]
[714,{"$f":"IF(W730=\"\",\"\",GETLat(W730))","v":""},{"$f":"IF(X730=\"\",\"\",GETLONG(X730))","v":""},"","","","",null,"",null,"",null,"",{"$f":"IF(U730=\"\", O730, MAPSYMBOL(O730, U730, $O$8))","v":""},"",null,null,null,null,null,null,null,null,null,""]
[715,{"$f":"IF(W731=\"\",\"\",GETLat(W731))","v":""},{"$f":"IF(X731=\"\",\"\",GETLONG(X731))","v":""},"","","","",null,"",null,"",null,"",{"$f":"IF(U731=\"\", O731, MAPSYMBOL(O731, U731, $O$8))","v":""},"",null,null,null,null,null,null,null,null,null,""]
[716,{"$f":"IF(W732=\"\",\"\",GETLat(W732))","v":""},{"$f":"IF(X732=\"\",\"\",GETLONG(X732))","v":""},"","","","",null,"",null,"",null,"",{"$f":"IF(U732=\"\", O732, MAPSYMBOL(O732, U732, $O$8))","v":""},"",null,null,null,null,null,null,null,null,null,""]
[717,{"$f":"IF(W733=\"\",\"\",GETLat(W733))","v":""},{"$f":"IF(X733=\"\",\"\",GETLONG(X733))","v":""},"","","","",null,"",null,"",null,"",{"$f":"IF(U733=\"\", O733, MAPSYMBOL(O733, U733, $O$8))","v":""},"",null,null,null,null,null,null,null,null,null,""]
[718,{"$f":"IF(W734=\"\",\"\",GETLat(W734))","v":""},{"$f":"IF(X734=\"\",\"\",GETLONG(X734))","v":""},"","","","",null,"",null,"",null,"",{"$f":"IF(U734=\"\", O734, MAPSYMBOL(O734, U734, $O$8))","v":""},"",null,null,null,null,null,null,null,null,null,""]
[719,{"$f":"IF(W735=\"\",\"\",GETLat(W735))","v":""},{"$f":"IF(X735=\"\",\"\",GETLONG(X735))","v":""},"","","","",null,"",null,"",null,"",{"$f":"IF(U735=\"\", O735, MAPSYMBOL(O735, U735, $O$8))","v":""},"",null,null,null,null,null,null,null,null,null,""]
[720,{"$f":"IF(W736=\"\",\"\",GETLat(W736))","v":""},{"$f":"IF(X736=\"\",\"\",GETLONG(X736))","v":""},"","","","",null,"",null,"",null,"",{"$f":"IF(U736=\"\", O736, MAPSYMBOL(O736, U736, $O$8))","v":""},"",null,null,null,null,null,null,null,null,null,""]
[721,{"$f":"IF(W737=\"\",\"\",GETLat(W737))","v":""},{"$f":"IF(X737=\"\",\"\",GETLONG(X737))","v":""},"","","","",null,"",null,"",null,"",{"$f":"IF(U737=\"\", O737, MAPSYMBOL(O737, U737, $O$8))","v":""},"",null,null,null,null,null,null,null,null,null,""]
[722,{"$f":"IF(W738=\"\",\"\",GETLat(W738))","v":""},{"$f":"IF(X738=\"\",\"\",GETLONG(X738))","v":""},"","","","",null,"",null,"",null,"",{"$f":"IF(U738=\"\", O738, MAPSYMBOL(O738, U738, $O$8))","v":""},"",null,null,null,null,null,null,null,null,null,""]
[723,{"$f":"IF(W739=\"\",\"\",GETLat(W739))","v":""},{"$f":"IF(X739=\"\",\"\",GETLONG(X739))","v":""},"","","","",null,"",null,"",null,"",{"$f":"IF(U739=\"\", O739, MAPSYMBOL(O739, U739, $O$8))","v":""},"",null,null,null,null,null,null,null,null,null,""]
[724,{"$f":"IF(W740=\"\",\"\",GETLat(W740))","v":""},{"$f":"IF(X740=\"\",\"\",GETLONG(X740))","v":""},"","","","",null,"",null,"",null,"",{"$f":"IF(U740=\"\", O740, MAPSYMBOL(O740, U740, $O$8))","v":""},"",null,null,null,null,null,null,null,null,null,""]
[725,{"$f":"IF(W741=\"\",\"\",GETLat(W741))","v":""},{"$f":"IF(X741=\"\",\"\",GETLONG(X741))","v":""},"","","","",null,"",null,"",null,"",{"$f":"IF(U741=\"\", O741, MAPSYMBOL(O741, U741, $O$8))","v":""},"",null,null,null,null,null,null,null,null,null,""]
[726,{"$f":"IF(W742=\"\",\"\",GETLat(W742))","v":""},{"$f":"IF(X742=\"\",\"\",GETLONG(X742))","v":""},"","","","",null,"",null,"",null,"",{"$f":"IF(U742=\"\", O742, MAPSYMBOL(O742, U742, $O$8))","v":""},"",null,null,null,null,null,null,null,null,null,""]
[727,{"$f":"IF(W743=\"\",\"\",GETLat(W743))","v":""},{"$f":"IF(X743=\"\",\"\",GETLONG(X743))","v":""},"","","","",null,"",null,"",null,"",{"$f":"IF(U743=\"\", O743, MAPSYMBOL(O743, U743, $O$8))","v":""},"",null,null,null,null,null,null,null,null,null,""]
[728,{"$f":"IF(W744=\"\",\"\",GETLat(W744))","v":""},{"$f":"IF(X744=\"\",\"\",GETLONG(X744))","v":""},"","","","",null,"",null,"",null,"",{"$f":"IF(U744=\"\", O744, MAPSYMBOL(O744, U744, $O$8))","v":""},"",null,null,null,null,null,null,null,null,null,""]
[729,{"$f":"IF(W745=\"\",\"\",GETLat(W745))","v":""},{"$f":"IF(X745=\"\",\"\",GETLONG(X745))","v":""},"","","","",null,"",null,"",null,"",{"$f":"IF(U745=\"\", O745, MAPSYMBOL(O745, U745, $O$8))","v":""},"",null,null,null,null,null,null,null,null,null,""]
[730,{"$f":"IF(W746=\"\",\"\",GETLat(W746))","v":""},{"$f":"IF(X746=\"\",\"\",GETLONG(X746))","v":""},"","","","",null,"",null,"",null,"",{"$f":"IF(U746=\"\", O746, MAPSYMBOL(O746, U746, $O$8))","v":""},"",null,null,null,null,null,null,null,null,null,""]
[731,{"$f":"IF(W747=\"\",\"\",GETLat(W747))","v":""},{"$f":"IF(X747=\"\",\"\",GETLONG(X747))","v":""},"","","","",null,"",null,"",null,"",{"$f":"IF(U747=\"\", O747, MAPSYMBOL(O747, U747, $O$8))","v":""},"",null,null,null,null,null,null,null,null,null,""]
[732,{"$f":"IF(W748=\"\",\"\",GETLat(W748))","v":""},{"$f":"IF(X748=\"\",\"\",GETLONG(X748))","v":""},"","","","",null,"",null,"",null,"",{"$f":"IF(U748=\"\", O748, MAPSYMBOL(O748, U748, $O$8))","v":""},"",null,null,null,null,null,null,null,null,null,""]
[733,{"$f":"IF(W749=\"\",\"\",GETLat(W749))","v":""},{"$f":"IF(X749=\"\",\"\",GETLONG(X749))","v":""},"","","","",null,"",null,"",null,"",{"$f":"IF(U749=\"\", O749, MAPSYMBOL(O749, U749, $O$8))","v":""},"",null,null,null,null,null,null,null,null,null,""]
[734,{"$f":"IF(W750=\"\",\"\",GETLat(W750))","v":""},{"$f":"IF(X750=\"\",\"\",GETLONG(X750))","v":""},"","","","",null,"",null,"",null,"",{"$f":"IF(U750=\"\", O750, MAPSYMBOL(O750, U750, $O$8))","v":""},"",null,null,null,null,null,null,null,null,null,""]
[735,{"$f":"IF(W751=\"\",\"\",GETLat(W751))","v":""},{"$f":"IF(X751=\"\",\"\",GETLONG(X751))","v":""},"","","","",null,"",null,"",null,"",{"$f":"IF(U751=\"\", O751, MAPSYMBOL(O751, U751, $O$8))","v":""},"",null,null,null,null,null,null,null,null,null,""]
[736,{"$f":"IF(W752=\"\",\"\",GETLat(W752))","v":""},{"$f":"IF(X752=\"\",\"\",GETLONG(X752))","v":""},"","","","",null,"",null,"",null,"",{"$f":"IF(U752=\"\", O752, MAPSYMBOL(O752, U752, $O$8))","v":""},"",null,null,null,null,null,null,null,null,null,""]
[737,{"$f":"IF(W753=\"\",\"\",GETLat(W753))","v":""},{"$f":"IF(X753=\"\",\"\",GETLONG(X753))","v":""},"","","","",null,"",null,"",null,"",{"$f":"IF(U753=\"\", O753, MAPSYMBOL(O753, U753, $O$8))","v":""},"",null,null,null,null,null,null,null,null,null,""]
[738,{"$f":"IF(W754=\"\",\"\",GETLat(W754))","v":""},{"$f":"IF(X754=\"\",\"\",GETLONG(X754))","v":""},"","","","",null,"",null,"",null,"",{"$f":"IF(U754=\"\", O754, MAPSYMBOL(O754, U754, $O$8))","v":""},"",null,null,null,null,null,null,null,null,null,""]
[739,{"$f":"IF(W755=\"\",\"\",GETLat(W755))","v":""},{"$f":"IF(X755=\"\",\"\",GETLONG(X755))","v":""},"","","","",null,"",null,"",null,"",{"$f":"IF(U755=\"\", O755, MAPSYMBOL(O755, U755, $O$8))","v":""},"",null,null,null,null,null,null,null,null,null,""]
[740,{"$f":"IF(W756=\"\",\"\",GETLat(W756))","v":""},{"$f":"IF(X756=\"\",\"\",GETLONG(X756))","v":""},"","","","",null,"",null,"",null,"",{"$f":"IF(U756=\"\", O756, MAPSYMBOL(O756, U756, $O$8))","v":""},"",null,null,null,null,null,null,null,null,null,""]
[741,{"$f":"IF(W757=\"\",\"\",GETLat(W757))","v":""},{"$f":"IF(X757=\"\",\"\",GETLONG(X757))","v":""},"","","","",null,"",null,"",null,"",{"$f":"IF(U757=\"\", O757, MAPSYMBOL(O757, U757, $O$8))","v":""},"",null,null,null,null,null,null,null,null,null,""]
[742,{"$f":"IF(W758=\"\",\"\",GETLat(W758))","v":""},{"$f":"IF(X758=\"\",\"\",GETLONG(X758))","v":""},"","","","",null,"",null,"",null,"",{"$f":"IF(U758=\"\", O758, MAPSYMBOL(O758, U758, $O$8))","v":""},"",null,null,null,null,null,null,null,null,null,""]
[743,{"$f":"IF(W759=\"\",\"\",GETLat(W759))","v":""},{"$f":"IF(X759=\"\",\"\",GETLONG(X759))","v":""},"","","","",null,"",null,"",null,"",{"$f":"IF(U759=\"\", O759, MAPSYMBOL(O759, U759, $O$8))","v":""},"",null,null,null,null,null,null,null,null,null,""]
[744,{"$f":"IF(W760=\"\",\"\",GETLat(W760))","v":""},{"$f":"IF(X760=\"\",\"\",GETLONG(X760))","v":""},"","","","",null,"",null,"",null,"",{"$f":"IF(U760=\"\", O760, MAPSYMBOL(O760, U760, $O$8))","v":""},"",null,null,null,null,null,null,null,null,null,""]
[745,{"$f":"IF(W761=\"\",\"\",GETLat(W761))","v":""},{"$f":"IF(X761=\"\",\"\",GETLONG(X761))","v":""},"","","","",null,"",null,"",null,"",{"$f":"IF(U761=\"\", O761, MAPSYMBOL(O761, U761, $O$8))","v":""},"",null,null,null,null,null,null,null,null,null,""]
[746,{"$f":"IF(W762=\"\",\"\",GETLat(W762))","v":""},{"$f":"IF(X762=\"\",\"\",GETLONG(X762))","v":""},"","","","",null,"",null,"",null,"",{"$f":"IF(U762=\"\", O762, MAPSYMBOL(O762, U762, $O$8))","v":""},"",null,null,null,null,null,null,null,null,null,""]
[747,{"$f":"IF(W763=\"\",\"\",GETLat(W763))","v":""},{"$f":"IF(X763=\"\",\"\",GETLONG(X763))","v":""},"","","","",null,"",null,"",null,"",{"$f":"IF(U763=\"\", O763, MAPSYMBOL(O763, U763, $O$8))","v":""},"",null,null,null,null,null,null,null,null,null,""]
[748,{"$f":"IF(W764=\"\",\"\",GETLat(W764))","v":""},{"$f":"IF(X764=\"\",\"\",GETLONG(X764))","v":""},"","","","",null,"",null,"",null,"",{"$f":"IF(U764=\"\", O764, MAPSYMBOL(O764, U764, $O$8))","v":""},"",null,null,null,null,null,null,null,null,null,""]
[749,{"$f":"IF(W765=\"\",\"\",GETLat(W765))","v":""},{"$f":"IF(X765=\"\",\"\",GETLONG(X765))","v":""},"","","","",null,"",null,"",null,"",{"$f":"IF(U765=\"\", O765, MAPSYMBOL(O765, U765, $O$8))","v":""},"",null,null,null,null,null,null,null,null,null,""]
[750,{"$f":"IF(W766=\"\",\"\",GETLat(W766))","v":""},{"$f":"IF(X766=\"\",\"\",GETLONG(X766))","v":""},"","","","",null,"",null,"",null,"",{"$f":"IF(U766=\"\", O766, MAPSYMBOL(O766, U766, $O$8))","v":""},"",null,null,null,null,null,null,null,null,null,""]

{"sheet":"Info","index":1,"n_rows":44,"n_cols":10,"rows_kept":44,"cut":false,"hidden":false,"merged":[[20,6,34,10],[35,6,35,13],[1,1,66,1],[43,3,58,4],[27,3,41,4],[22,3,25,4]]}
[]
[null,"The core feature of this application: Waypoint information is exported to a GPX file. It also provides features for efficiently entering and coding road rally bonus location information before export, including combination bonuses. Lat/long values are converted to decimal degrees for export when entered in any common format. Map symbols are assigned based on location point values and then optionally modified for individual location requirements.\n\nTo begin a new session: \nClear cell contents in the yellow area of the Prep sheet. This will also clear the green and white columns, which fill automatically from the yellow area. \n\nIn the Locations block, enter Name, Comment(location), Points, Suffix(as needed) and Lat/Long if available. Formulas will copy it to the green columns. This separation provides important options: optional automatic combining the Name, Points and Suffix, sorting, and pasting in Lat/Long values from on-line sources, if needed.\n\nA combo item is entered as a location with blank lat/long values, the point value of the combo item, and the comment containing the names of the locations separated by commas, no spaces. The combo is displayed in the mapping program as a track line connecting the locations.\n\nThe Name can be the bonus id with or without additional codes . The green waypoint Name column can be set with a check box to show the name only or the name plus points and suffix. You are free to encode the name and waypoint name however you like. See red comments on the Prep sheet for more details\n\nIf Lat/Long are not available, the Comment column of locations can be copy/pasted into  the GPSVisualizer web site. You will need a free key from Bing, MapQuest or Google. The GPSVisualizer website has links to get a key. Request tab seperated results. Copy all the resulting information and paste it into a cell to the right of the Map column (this avoids overwriting the map links). Copy and paste the Lat/Long values into the yellow columns.  The pasted Lat/Long data is copied to the green area and converted to the decimal degrees format. Extra information from the geocoding can be ignored. The quality of computer geocoding is, of course, not guaranteed. After the contents of the Comment column is used for the geocoding, it can be modified as desired for the waypoint Comment field.\n\nAfter bonus points are entered, map symbols are automatically assigned to each bonus location based on point values in the top Symbol Assignment table. These symbols make it easier to evaluate bonus locations on the BaseCamp map display. Enter the minimum point value, or percentile, for as many symbols as desired (increasing values). The symbol names in the table should be those recognized by the Garmin Basecamp program. They are entered as name or name, color. Some commonly used names and colors are on this page.\n\nBefore exporting the file, enter the file name and the file path in the top of the Waypoints box. See the red comment for format. The suffix .gpx will be added to the file name.\n\nWhen the waypoint and file information is the way you want it, select desired rows and all green columns and click Export to GPX. The resulting GPX file can be imported by the Garmin Basecamp and recent versions of Garmin Mapsource programs\n\n... When a tentative route has been selected, the Route block can be used to find the route point total. Sort the locations by Name and place a mark (x) in the Route column for each location in the route. Total points are on the top with number of marked locations.\n\n... When routes are determined, transfer waypoints and routes from BaseCamp or Mapsource to your GPS unit.\n\nNote: Cell formulas may be changed in any way you desire. This will not interfere  with the ability to export a GPX file using data in the 5 green columns.\n\n- Charles Turner",null,"Symbols: name, color",null,null,"Custom symbols:"]
[null,null,null,"flag","red, green, blue",null,"Name","Design","ChgTo","Possible use"]
[null,null,null,"block","red, green, blue",null,"Custom 0"]
[null,null,null,"pin","red, green, blue",null,"Custom 1","tri green"]
[null,null,null,"circle","red, green, blue",null,"Custom 2","tri blue"]
[null,null,null,"oval","red, green, blue",null,"Custom 3","tri violet","jump+0","points/24 hours"]
[null,null,null,"rectangle","red, green, blue",null,"Custom 4","tri gold"]
[null,null,null,"square","red, green, blue",null,"Custom 5","tri red"]
[null,null,null,"triangle","red, green, blue",null,"Custom 6","cir green"]
[null,null,null,"diamond","red, green, blue",null,"Custom 7","cir blue"]
[null,null,null,"dot (square)","white",null,"Custom 8","cir violet","jump+5","points/daylight"]
[null,null,null,"navaid (circle)","red, green, blue,",null,"Custom 9","cir gold"]
[null,null,null,null,"orange, amber, violet,",null,"Custom 10","cir red"]
[null,null,null,null,"black, white, ",null,"Custom 11","sqr green"]
[null,null,null,null,"green/red, green/white",null,"Custom 12","sqr blue"]
[null,null,null,null,"red/green, red/white, ",null,"Custom 13","sqr violet","jump+10","points/timed"]
[null,null,null,null,"white/green, white/red",null,"Custom 14","sqr gold"]
[null,null,null,null,null,null,"Custom 15","sqr red"]
[null,null,null,"GPS Visualizer: "]
[null,null,null," <http://www.gpsvisualizer.com/geocoder/>",null,null,"Custom symbols:\nCustom symbols can be used with names in the form Custom #. Not very descriptive, but it works. \n\nIf the symbols are in equal sized groups, the symbols can be changed with entries in the Chg Symbol block. The ChgTo entries should be in the form jump+# or jump-#, such as jump+7 or jump-7 to move from one group of 7 to the same place in the next group. See a sample arrangement above with 5 in the groups. \n\nThe symbol images will, of course, have to be created or located, properly named, and added to the BaseCamp app and your GPS unit. The image names will be slightly different from above, but it’s the number that counts.\n\nTry the link below for details on creating and adding custom symbols to Basecamp and your Garmin GPS. "]
[]
[null,null,null,"Note Mac users - Excel for Mac v14 (Office 2011) does not reliably export and import files. Both Excel v15 and the LibreOffice spreadsheet are reliable with a Mac."]
[]
[]
[]
[]
[null,null,null,"Extended content:\nWhen exporting, leg values and suffix values can be included in the GPS and TXT files by extending the export selection area to include the Leg column or the Leg and Suffix columns in the yellow area.\n\nWhen the GPX file is imported into Bonii-Prep, the extended content will import into the appropriate columns. BaseCamp imports will ignore the extended content in the GPX file.\n\nThe TXT file is formatted for direct copy/paste into Bonii-Prep. When extended content is not included, there are empty fields for Leg and Suffix values."]
[]
[]
[]
[]
[]
[]
[]
[null,null,null,null,null,null,"https://support.garmin.com/en-US/?faq=0c2IHhAhvg6ttRP3u7yZ46&searchType=noProduct>"]
[]
[]
[]
[]
[]
[]
[]
[null,null,null,"Credits: \nEasy-Bake for showing what needed to be done. \n\nRaymond Pang for his “Convert XML” code showing the way to export .gpx files.  \n  \nPeter Ihlo for helping get the comma as a decimal separator working on systems that are expecting that usage.\n\nJohn Huval for suggesting the value of location links to Google Maps.\n\nRon Messick for showing the need for a method to use custom symbols."]

{"sheet":"Routes","index":2,"n_rows":766,"n_cols":24,"rows_kept":766,"cut":false,"hidden":false,"merged":[[13,21,13,23],[3,1,3,5],[13,5,13,7],[13,9,13,11],[13,13,13,15],[13,17,13,19]]}
[]
[]
[]
[]
[null,"Alternate Route Points",null,null,null,null,null,"Caution: "]
[null,"Click \"Get Locations\" button -- see Caution.",null,null,null,null,null,"Using Get Locations could invalidate marks"]
[null,"Enter a character in the yellow column for each location on a route.",null,null,null,null,null,"if the Prep sheet sort, content or marks"]
[null,"Marks in Route A are imported from the Prep sheet.",null,null,null,null,null,"are diffeent from this sheet."]
[null,"Count and point totals are at the column top."]
[null,"Sort by N, C or P buttons."]
[]
[]
[]
[null,null,"Locations",null,null,"Route A Points",null,null,null,"Route B Points",null,null,null,"Route C Points",null,null,null,"Route D Points",null,null,null,"Route E Points"]
[]
[null,"Name","Comment","Points",null,"Name",{"$f":"COUNTA(G17:G768)","v":2},{"$f":"SUM(H17:H768)","v":871},null,"Name",{"$f":"COUNTA(K17:K768)","v":0},{"$f":"SUM(L17:L768)","v":0},null,"Name",{"$f":"COUNTA(O17:O768)","v":0},{"$f":"SUM(P17:P768)","v":0},null,"Name",{"$f":"COUNTA(S17:S768)","v":0},{"$f":"SUM(T17:T768)","v":0},null,"Name",{"$f":"COUNTA(W17:W768)","v":0},{"$f":"SUM(X17:X768)","v":0}]
[null,"KIM","Kimball, MN",1,null,"KIM","x",{"$f":"IF(G17=\"\",\"\",D17)","v":1},null,"KIM",null,{"$f":"IF(K17=\"\",\"\",D17)","v":""},null,"KIM",null,{"$f":"IF(O17=\"\",\"\",D17)","v":""},null,"KIM",null,{"$f":"IF(S17=\"\",\"\",D17)","v":""},null,"KIM",null,{"$f":"IF(W17=\"\",\"\",D17)","v":""}]
[null,"Comb1","15,12,09,11",111,null,"Comb1",null,"",null,"Comb1",null,"",null,"Comb1",null,"",null,"Comb1",null,"",null,"Comb1",null,""]
[null,"AVO","Avon, MN",197,null,"AVO",null,"",null,"AVO",null,"",null,"AVO",null,"",null,"AVO",null,"",null,"AVO",null,""]
[null,"BLG","Belgrade, MN",200,null,"BLG",null,"",null,"BLG",null,"",null,"BLG",null,"",null,"BLG",null,"",null,"BLG",null,""]
[null,4,"Lamars, ND",223,null,4,null,"",null,4,null,"",null,4,null,"",null,4,null,"",null,4,null,""]
[null,12,"Halden Township, MN",425,null,12,null,"",null,12,null,"",null,12,null,"",null,12,null,"",null,12,null,""]
[null,7,"Manhattan Beach, MN",450,null,7,null,"",null,7,null,"",null,7,null,"",null,7,null,"",null,7,null,""]
[null,"H9BNM","Wild Card – Arch<",450,null,"H9BNM",null,"",null,"H9BNM",null,"",null,"H9BNM",null,"",null,"H9BNM",null,"",null,"H9BNM",null,""]
[null,15,"Clearwater, MN",495,null,15,null,"",null,15,null,"",null,15,null,"",null,15,null,"",null,15,null,""]
[null,11,"7393 State HWY 371, Brainard, MN",500,null,11,null,"",null,11,null,"",null,11,null,"",null,11,null,"",null,11,null,""]
[null,"FRE","Sand Creek, WI",555,null,"FRE",null,"",null,"FRE",null,"",null,"FRE",null,"",null,"FRE",null,"",null,"FRE",null,""]
[null,9,"Aldrich, MN",680,null,9,null,"",null,9,null,"",null,9,null,"",null,9,null,"",null,9,null,""]
[null,"FAI","Bruce, SD",850,null,"FAI",null,"",null,"FAI",null,"",null,"FAI",null,"",null,"FAI",null,"",null,"FAI",null,""]
[null,"GRO","Grove City, MN",870,null,"GRO","x ",870,null,"GRO",null,"",null,"GRO",null,"",null,"GRO",null,"",null,"GRO",null,""]
[null,8,"72158 County Rd. 30, Fairfax, MN",987,null,8,null,"",null,8,null,"",null,8,null,"",null,8,null,"",null,8,null,""]
[null,"HAW","Paynesville, MN",1015,null,"HAW",null,"",null,"HAW",null,"",null,"HAW",null,"",null,"HAW",null,"",null,"HAW",null,""]
[null,"LIT","Little Falls, MN",1022,null,"LIT",null,"",null,"LIT",null,"",null,"LIT",null,"",null,"LIT",null,"",null,"LIT",null,""]
[null,1,"Breckenridge, MN",1112,null,1,null,"",null,1,null,"",null,1,null,"",null,1,null,"",null,1,null,""]
[null,"HEN","Vesta Township, MN",0,null,"HEN",null,"",null,"HEN",null,"",null,"HEN",null,"",null,"HEN",null,"",null,"HEN",null,""]
[null,"BEL","Belle Plain, MN",0,null,"BEL",null,"",null,"BEL",null,"",null,"BEL",null,"",null,"BEL",null,"",null,"BEL",null,""]
[null,null,null,null,null,null,null,{"$f":"IF(G37=\"\",\"\",D37)","v":""},null,null,null,{"$f":"IF(K37=\"\",\"\",D37)","v":""},null,null,null,{"$f":"IF(O37=\"\",\"\",D37)","v":""},null,null,null,{"$f":"IF(S37=\"\",\"\",D37)","v":""},null,null,null,{"$f":"IF(W37=\"\",\"\",D37)","v":""}]
[null,null,null,null,null,null,null,"",null,null,null,"",null,null,null,"",null,null,null,"",null,null,null,""]
[null,null,null,null,null,null,null,"",null,null,null,"",null,null,null,"",null,null,null,"",null,null,null,""]
[null,null,null,null,null,null,null,"",null,null,null,"",null,null,null,"",null,null,null,"",null,null,null,""]
[null,null,null,null,null,null,null,"",null,null,null,"",null,null,null,"",null,null,null,"",null,null,null,""]
[null,null,null,null,null,null,null,"",null,null,null,"",null,null,null,"",null,null,null,"",null,null,null,""]
[null,null,null,null,null,null,null,"",null,null,null,"",null,null,null,"",null,null,null,"",null,null,null,""]
[null,null,null,null,null,null,null,"",null,null,null,"",null,null,null,"",null,null,null,"",null,null,null,""]
[null,null,null,null,null,null,null,"",null,null,null,"",null,null,null,"",null,null,null,"",null,null,null,""]
[null,null,null,null,null,null,null,"",null,null,null,"",null,null,null,"",null,null,null,"",null,null,null,""]
[null,null,null,null,null,null,null,"",null,null,null,"",null,null,null,"",null,null,null,"",null,null,null,""]
[null,null,null,null,null,null,null,"",null,null,null,"",null,null,null,"",null,null,null,"",null,null,null,""]
[null,null,null,null,null,null,null,"",null,null,null,"",null,null,null,"",null,null,null,"",null,null,null,""]
[null,null,null,null,null,null,null,"",null,null,null,"",null,null,null,"",null,null,null,"",null,null,null,""]
[null,null,null,null,null,null,null,"",null,null,null,"",null,null,null,"",null,null,null,"",null,null,null,""]
[null,null,null,null,null,null,null,"",null,null,null,"",null,null,null,"",null,null,null,"",null,null,null,""]
[null,null,null,null,null,null,null,"",null,null,null,"",null,null,null,"",null,null,null,"",null,null,null,""]
[null,null,null,null,null,null,null,"",null,null,null,"",null,null,null,"",null,null,null,"",null,null,null,""]
[null,null,null,null,null,null,null,"",null,null,null,"",null,null,null,"",null,null,null,"",null,null,null,""]
[null,null,null,null,null,null,null,"",null,null,null,"",null,null,null,"",null,null,null,"",null,null,null,""]
[null,null,null,null,null,null,null,"",null,null,null,"",null,null,null,"",null,null,null,"",null,null,null,""]
[null,null,null,null,null,null,null,"",null,null,null,"",null,null,null,"",null,null,null,"",null,null,null,""]
[null,null,null,null,null,null,null,"",null,null,null,"",null,null,null,"",null,null,null,"",null,null,null,""]
[null,null,null,null,null,null,null,"",null,null,null,"",null,null,null,"",null,null,null,"",null,null,null,""]
[null,null,null,null,null,null,null,"",null,null,null,"",null,null,null,"",null,null,null,"",null,null,null,""]
[null,null,null,null,null,null,null,"",null,null,null,"",null,null,null,"",null,null,null,"",null,null,null,""]
[null,null,null,null,null,null,null,"",null,null,null,"",null,null,null,"",null,null,null,"",null,null,null,""]
[null,null,null,null,null,null,null,"",null,null,null,"",null,null,null,"",null,null,null,"",null,null,null,""]
[null,null,null,null,null,null,null,"",null,null,null,"",null,null,null,"",null,null,null,"",null,null,null,""]
[null,null,null,null,null,null,null,"",null,null,null,"",null,null,null,"",null,null,null,"",null,null,null,""]
[null,null,null,null,null,null,null,"",null,null,null,"",null,null,null,"",null,null,null,"",null,null,null,""]
[null,null,null,null,null,null,null,"",null,null,null,"",null,null,null,"",null,null,null,"",null,null,null,""]
[null,null,null,null,null,null,null,"",null,null,null,"",null,null,null,"",null,null,null,"",null,null,null,""]
[null,null,null,null,null,null,null,"",null,null,null,"",null,null,null,"",null,null,null,"",null,null,null,""]
[null,null,null,null,null,null,null,"",null,null,null,"",null,null,null,"",null,null,null,"",null,null,null,""]
[null,null,null,null,null,null,null,"",null,null,null,"",null,null,null,"",null,null,null,"",null,null,null,""]
[null,null,null,null,null,null,null,"",null,null,null,"",null,null,null,"",null,null,null,"",null,null,null,""]
[null,null,null,null,null,null,null,"",null,null,null,"",null,null,null,"",null,null,null,"",null,null,null,""]
[null,null,null,null,null,null,null,"",null,null,null,"",null,null,null,"",null,null,null,"",null,null,null,""]
[null,null,null,null,null,null,null,"",null,null,null,"",null,null,null,"",null,null,null,"",null,null,null,""]
[null,null,null,null,null,null,null,"",null,null,null,"",null,null,null,"",null,null,null,"",null,null,null,""]
[null,null,null,null,null,null,null,"",null,null,null,"",null,null,null,"",null,null,null,"",null,null,null,""]
[null,null,null,null,null,null,null,"",null,null,null,"",null,null,null,"",null,null,null,"",null,null,null,""]
[null,null,null,null,null,null,null,"",null,null,null,"",null,null,null,"",null,null,null,"",null,null,null,""]
[null,null,null,null,null,null,null,"",null,null,null,"",null,null,null,"",null,null,null,"",null,null,null,""]
[null,null,null,null,null,null,null,"",null,null,null,"",null,null,null,"",null,null,null,"",null,null,null,""]
[null,null,null,null,null,null,null,"",null,null,null,"",null,null,null,"",null,null,null,"",null,null,null,""]
[null,null,null,null,null,null,null,"",null,null,null,"",null,null,null,"",null,null,null,"",null,null,null,""]
[null,null,null,null,null,null,null,"",null,null,null,"",null,null,null,"",null,null,null,"",null,null,null,""]
[null,null,null,null,null,null,null,"",null,null,null,"",null,null,null,"",null,null,null,"",null,null,null,""]
[null,null,null,null,null,null,null,"",null,null,null,"",null,null,null,"",null,null,null,"",null,null,null,""]
[null,null,null,null,null,null,null,"",null,null,null,"",null,null,null,"",null,null,null,"",null,null,null,""]
[null,null,null,null,null,null,null,"",null,null,null,"",null,null,null,"",null,null,null,"",null,null,null,""]
[null,null,null,null,null,null,null,"",null,null,null,"",null,null,null,"",null,null,null,"",null,null,null,""]
[null,null,null,null,null,null,null,"",null,null,null,"",null,null,null,"",null,null,null,"",null,null,null,""]
[null,null,null,null,null,null,null,"",null,null,null,"",null,null,null,"",null,null,null,"",null,null,null,""]
[null,null,null,null,null,null,null,"",null,null,null,"",null,null,null,"",null,null,null,"",null,null,null,""]
[null,null,null,null,null,null,null,"",null,null,null,"",null,null,null,"",null,null,null,"",null,null,null,""]
[null,null,null,null,null,null,null,"",null,null,null,"",null,null,null,"",null,null,null,"",null,null,null,""]
[null,null,null,null,null,null,null,"",null,null,null,"",null,null,null,"",null,null,null,"",null,null,null,""]
[null,null,null,null,null,null,null,"",null,null,null,"",null,null,null,"",null,null,null,"",null,null,null,""]
[null,null,null,null,null,null,null,"",null,null,null,"",null,null,null,"",null,null,null,"",null,null,null,""]
[null,null,null,null,null,null,null,"",null,null,null,"",null,null,null,"",null,null,null,"",null,null,null,""]
[null,null,null,null,null,null,null,"",null,null,null,"",null,null,null,"",null,null,null,"",null,null,null,""]
[null,null,null,null,null,null,null,{"$f":"IF(G101=\"\",\"\",D101)","v":""},null,null,null,{"$f":"IF(K101=\"\",\"\",D101)","v":""},null,null,null,{"$f":"IF(O101=\"\",\"\",D101)","v":""},null,null,null,{"$f":"IF(S101=\"\",\"\",D101)","v":""},null,null,null,{"$f":"IF(W101=\"\",\"\",D101)","v":""}]
[null,null,null,null,null,null,null,"",null,null,null,"",null,null,null,"",null,null,null,"",null,null,null,""]
[null,null,null,null,null,null,null,"",null,null,null,"",null,null,null,"",null,null,null,"",null,null,null,""]
[null,null,null,null,null,null,null,"",null,null,null,"",null,null,null,"",null,null,null,"",null,null,null,""]
[null,null,null,null,null,null,null,"",null,null,null,"",null,null,null,"",null,null,null,"",null,null,null,""]
[null,null,null,null,null,null,null,"",null,null,null,"",null,null,null,"",null,null,null,"",null,null,null,""]
[null,null,null,null,null,null,null,"",null,null,null,"",null,null,null,"",null,null,null,"",null,null,null,""]
[null,null,null,null,null,null,null,"",null,null,null,"",null,null,null,"",null,null,null,"",null,null,null,""]
[null,null,null,null,null,null,null,"",null,null,null,"",null,null,null,"",null,null,null,"",null,null,null,""]
[null,null,null,null,null,null,null,"",null,null,null,"",null,null,null,"",null,null,null,"",null,null,null,""]
[null,null,null,null,null,null,null,"",null,null,null,"",null,null,null,"",null,null,null,"",null,null,null,""]
[null,null,null,null,null,null,null,"",null,null,null,"",null,null,null,"",null,null,null,"",null,null,null,""]
[null,null,null,null,null,null,null,"",null,null,null,"",null,null,null,"",null,null,null,"",null,null,null,""]
[null,null,null,null,null,null,null,"",null,null,null,"",null,null,null,"",null,null,null,"",null,null,null,""]
[null,null,null,null,null,null,null,"",null,null,null,"",null,null,null,"",null,null,null,"",null,null,null,""]
[null,null,null,null,null,null,null,"",null,null,null,"",null,null,null,"",null,null,null,"",null,null,null,""]
[null,null,null,null,null,null,null,"",null,null,null,"",null,null,null,"",null,null,null,"",null,null,null,""]
[null,null,null,null,null,null,null,"",null,null,null,"",null,null,null,"",null,null,null,"",null,null,null,""]
[null,null,null,null,null,null,null,"",null,null,null,"",null,null,null,"",null,null,null,"",null,null,null,""]
[null,null,null,null,null,null,null,"",null,null,null,"",null,null,null,"",null,null,null,"",null,null,null,""]
[null,null,null,null,null,null,null,"",null,null,null,"",null,null,null,"",null,null,null,"",null,null,null,""]
[null,null,null,null,null,null,null,"",null,null,null,"",null,null,null,"",null,null,null,"",null,null,null,""]
[null,null,null,null,null,null,null,"",null,null,null,"",null,null,null,"",null,null,null,"",null,null,null,""]
[null,null,null,null,null,null,null,"",null,null,null,"",null,null,null,"",null,null,null,"",null,null,null,""]
[null,null,null,null,null,null,null,"",null,null,null,"",null,null,null,"",null,null,null,"",null,null,null,""]
[null,null,null,null,null,null,null,"",null,null,null,"",null,null,null,"",null,null,null,"",null,null,null,""]
[null,null,null,null,null,null,null,"",null,null,null,"",null,null,null,"",null,null,null,"",null,null,null,""]
[null,null,null,null,null,null,null,"",null,null,null,"",null,null,null,"",null,null,null,"",null,null,null,""]
[null,null,null,null,null,null,null,"",null,null,null,"",null,null,null,"",null,null,null,"",null,null,null,""]
[null,null,null,null,null,null,null,"",null,null,null,"",null,null,null,"",null,null,null,"",null,null,null,""]
[null,null,null,null,null,null,null,"",null,null,null,"",null,null,null,"",null,null,null,"",null,null,null,""]
[null,null,null,null,null,null,null,"",null,null,null,"",null,null,null,"",null,null,null,"",null,null,null,""]
[null,null,null,null,null,null,null,"",null,null,null,"",null,null,null,"",null,null,null,"",null,null,null,""]
[null,null,null,null,null,null,null,"",null,null,null,"",null,null,null,"",null,null,null,"",null,null,null,""]
[null,null,null,null,null,null,null,"",null,null,null,"",null,null,null,"",null,null,null,"",null,null,null,""]
[null,null,null,null,null,null,null,"",null,null,null,"",null,null,null,"",null,null,null,"",null,null,null,""]
[null,null,null,null,null,null,null,"",null,null,null,"",null,null,null,"",null,null,null,"",null,null,null,""]
[null,null,null,null,null,null,null,"",null,null,null,"",null,null,null,"",null,null,null,"",null,null,null,""]
[null,null,null,null,null,null,null,"",null,null,null,"",null,null,null,"",null,null,null,"",null,null,null,""]
[null,null,null,null,null,null,null,"",null,null,null,"",null,null,null,"",null,null,null,"",null,null,null,""]
[null,null,null,null,null,null,null,"",null,null,null,"",null,null,null,"",null,null,null,"",null,null,null,""]
[null,null,null,null,null,null,null,"",null,null,null,"",null,null,null,"",null,null,null,"",null,null,null,""]
[null,null,null,null,null,null,null,"",null,null,null,"",null,null,null,"",null,null,null,"",null,null,null,""]
[null,null,null,null,null,null,null,"",null,null,null,"",null,null,null,"",null,null,null,"",null,null,null,""]
[null,null,null,null,null,null,null,"",null,null,null,"",null,null,null,"",null,null,null,"",null,null,null,""]
[null,null,null,null,null,null,null,"",null,null,null,"",null,null,null,"",null,null,null,"",null,null,null,""]
[null,null,null,null,null,null,null,"",null,null,null,"",null,null,null,"",null,null,null,"",null,null,null,""]
[null,null,null,null,null,null,null,"",null,null,null,"",null,null,null,"",null,null,null,"",null,null,null,""]
[null,null,null,null,null,null,null,"",null,null,null,"",null,null,null,"",null,null,null,"",null,null,null,""]
[null,null,null,null,null,null,null,"",null,null,null,"",null,null,null,"",null,null,null,"",null,null,null,""]
[null,null,null,null,null,null,null,"",null,null,null,"",null,null,null,"",null,null,null,"",null,null,null,""]
[null,null,null,null,null,null,null,"",null,null,null,"",null,null,null,"",null,null,null,"",null,null,null,""]
[null,null,null,null,null,null,null,"",null,null,null,"",null,null,null,"",null,null,null,"",null,null,null,""]
[null,null,null,null,null,null,null,"",null,null,null,"",null,null,null,"",null,null,null,"",null,null,null,""]
[null,null,null,null,null,null,null,"",null,null,null,"",null,null,null,"",null,null,null,"",null,null,null,""]
[null,null,null,null,null,null,null,"",null,null,null,"",null,null,null,"",null,null,null,"",null,null,null,""]
[null,null,null,null,null,null,null,"",null,null,null,"",null,null,null,"",null,null,null,"",null,null,null,""]
[null,null,null,null,null,null,null,"",null,null,null,"",null,null,null,"",null,null,null,"",null,null,null,""]
[null,null,null,null,null,null,null,"",null,null,null,"",null,null,null,"",null,null,null,"",null,null,null,""]
[null,null,null,null,null,null,null,"",null,null,null,"",null,null,null,"",null,null,null,"",null,null,null,""]
[null,null,null,null,null,null,null,"",null,null,null,"",null,null,null,"",null,null,null,"",null,null,null,""]
[null,null,null,null,null,null,null,"",null,null,null,"",null,null,null,"",null,null,null,"",null,null,null,""]
[null,null,null,null,null,null,null,"",null,null,null,"",null,null,null,"",null,null,null,"",null,null,null,""]
[null,null,null,null,null,null,null,"",null,null,null,"",null,null,null,"",null,null,null,"",null,null,null,""]
[null,null,null,null,null,null,null,{"$f":"IF(G165=\"\",\"\",D165)","v":""},null,null,null,{"$f":"IF(K165=\"\",\"\",D165)","v":""},null,null,null,{"$f":"IF(O165=\"\",\"\",D165)","v":""},null,null,null,{"$f":"IF(S165=\"\",\"\",D165)","v":""},null,null,null,{"$f":"IF(W165=\"\",\"\",D165)","v":""}]
[null,null,null,null,null,null,null,"",null,null,null,"",null,null,null,"",null,null,null,"",null,null,null,""]
[null,null,null,null,null,null,null,"",null,null,null,"",null,null,null,"",null,null,null,"",null,null,null,""]
[null,null,null,null,null,null,null,"",null,null,null,"",null,null,null,"",null,null,null,"",null,null,null,""]
[null,null,null,null,null,null,null,"",null,null,null,"",null,null,null,"",null,null,null,"",null,null,null,""]
[null,null,null,null,null,null,null,"",null,null,null,"",null,null,null,"",null,null,null,"",null,null,null,""]
[null,null,null,null,null,null,null,"",null,null,null,"",null,null,null,"",null,null,null,"",null,null,null,""]
[null,null,null,null,null,null,null,"",null,null,null,"",null,null,null,"",null,null,null,"",null,null,null,""]
[null,null,null,null,null,null,null,"",null,null,null,"",null,null,null,"",null,null,null,"",null,null,null,""]
[null,null,null,null,null,null,null,"",null,null,null,"",null,null,null,"",null,null,null,"",null,null,null,""]
[null,null,null,null,null,null,null,"",null,null,null,"",null,null,null,"",null,null,null,"",null,null,null,""]
[null,null,null,null,null,null,null,"",null,null,null,"",null,null,null,"",null,null,null,"",null,null,null,""]
[null,null,null,null,null,null,null,"",null,null,null,"",null,null,null,"",null,null,null,"",null,null,null,""]
[null,null,null,null,null,null,null,"",null,null,null,"",null,null,null,"",null,null,null,"",null,null,null,""]
[null,null,null,null,null,null,null,"",null,null,null,"",null,null,null,"",null,null,null,"",null,null,null,""]
[null,null,null,null,null,null,null,"",null,null,null,"",null,null,null,"",null,null,null,"",null,null,null,""]
[null,null,null,null,null,null,null,"",null,null,null,"",null,null,null,"",null,null,null,"",null,null,null,""]
[null,null,null,null,null,null,null,"",null,null,null,"",null,null,null,"",null,null,null,"",null,null,null,""]
[null,null,null,null,null,null,null,"",null,null,null,"",null,null,null,"",null,null,null,"",null,null,null,""]
[null,null,null,null,null,null,null,"",null,null,null,"",null,null,null,"",null,null,null,"",null,null,null,""]
[null,null,null,null,null,null,null,"",null,null,null,"",null,null,null,"",null,null,null,"",null,null,null,""]
[null,null,null,null,null,null,null,"",null,null,null,"",null,null,null,"",null,null,null,"",null,null,null,""]
[null,null,null,null,null,null,null,"",null,null,null,"",null,null,null,"",null,null,null,"",null,null,null,""]
[null,null,null,null,null,null,null,"",null,null,null,"",null,null,null,"",null,null,null,"",null,null,null,""]
[null,null,null,null,null,null,null,"",null,null,null,"",null,null,null,"",null,null,null,"",null,null,null,""]
[null,null,null,null,null,null,null,"",null,null,null,"",null,null,null,"",null,null,null,"",null,null,null,""]
[null,null,null,null,null,null,null,"",null,null,null,"",null,null,null,"",null,null,null,"",null,null,null,""]
[null,null,null,null,null,null,null,"",null,null,null,"",null,null,null,"",null,null,null,"",null,null,null,""]
[null,null,null,null,null,null,null,"",null,null,null,"",null,null,null,"",null,null,null,"",null,null,null,""]
[null,null,null,null,null,null,null,"",null,null,null,"",null,null,null,"",null,null,null,"",null,null,null,""]
[null,null,null,null,null,null,null,"",null,null,null,"",null,null,null,"",null,null,null,"",null,null,null,""]
[null,null,null,null,null,null,null,"",null,null,null,"",null,null,null,"",null,null,null,"",null,null,null,""]
[null,null,null,null,null,null,null,"",null,null,null,"",null,null,null,"",null,null,null,"",null,null,null,""]
[null,null,null,null,null,null,null,"",null,null,null,"",null,null,null,"",null,null,null,"",null,null,null,""]
[null,null,null,null,null,null,null,"",null,null,null,"",null,null,null,"",null,null,null,"",null,null,null,""]
[null,null,null,null,null,null,null,"",null,null,null,"",null,null,null,"",null,null,null,"",null,null,null,""]
[null,null,null,null,null,null,null,"",null,null,null,"",null,null,null,"",null,null,null,"",null,null,null,""]
[null,null,null,null,null,null,null,"",null,null,null,"",null,null,null,"",null,null,null,"",null,null,null,""]
[null,null,null,null,null,null,null,"",null,null,null,"",null,null,null,"",null,null,null,"",null,null,null,""]
[null,null,null,null,null,null,null,"",null,null,null,"",null,null,null,"",null,null,null,"",null,null,null,""]
[null,null,null,null,null,null,null,"",null,null,null,"",null,null,null,"",null,null,null,"",null,null,null,""]
[null,null,null,null,null,null,null,"",null,null,null,"",null,null,null,"",null,null,null,"",null,null,null,""]
[null,null,null,null,null,null,null,"",null,null,null,"",null,null,null,"",null,null,null,"",null,null,null,""]
[null,null,null,null,null,null,null,"",null,null,null,"",null,null,null,"",null,null,null,"",null,null,null,""]
[null,null,null,null,null,null,null,"",null,null,null,"",null,null,null,"",null,null,null,"",null,null,null,""]
[null,null,null,null,null,null,null,"",null,null,null,"",null,null,null,"",null,null,null,"",null,null,null,""]
[null,null,null,null,null,null,null,"",null,null,null,"",null,null,null,"",null,null,null,"",null,null,null,""]
[null,null,null,null,null,null,null,"",null,null,null,"",null,null,null,"",null,null,null,"",null,null,null,""]
[null,null,null,null,null,null,null,"",null,null,null,"",null,null,null,"",null,null,null,"",null,null,null,""]
[null,null,null,null,null,null,null,"",null,null,null,"",null,null,null,"",null,null,null,"",null,null,null,""]
[null,null,null,null,null,null,null,"",null,null,null,"",null,null,null,"",null,null,null,"",null,null,null,""]
[null,null,null,null,null,null,null,"",null,null,null,"",null,null,null,"",null,null,null,"",null,null,null,""]
[null,null,null,null,null,null,null,"",null,null,null,"",null,null,null,"",null,null,null,"",null,null,null,""]
[null,null,null,null,null,null,null,"",null,null,null,"",null,null,null,"",null,null,null,"",null,null,null,""]
[null,null,null,null,null,null,null,"",null,null,null,"",null,null,null,"",null,null,null,"",null,null,null,""]
[null,null,null,null,null,null,null,"",null,null,null,"",null,null,null,"",null,null,null,"",null,null,null,""]
[null,null,null,null,null,null,null,"",null,null,null,"",null,null,null,"",null,null,null,"",null,null,null,""]
[null,null,null,null,null,null,null,"",null,null,null,"",null,null,null,"",null,null,null,"",null,null,null,""]
[null,null,null,null,null,null,null,"",null,null,null,"",null,null,null,"",null,null,null,"",null,null,null,""]
[null,null,null,null,null,null,null,"",null,null,null,"",null,null,null,"",null,null,null,"",null,null,null,""]
[null,null,null,null,null,null,null,"",null,null,null,"",null,null,null,"",null,null,null,"",null,null,null,""]
[null,null,null,null,null,null,null,"",null,null,null,"",null,null,null,"",null,null,null,"",null,null,null,""]
[null,null,null,null,null,null,null,"",null,null,null,"",null,null,null,"",null,null,null,"",null,null,null,""]
[null,null,null,null,null,null,null,"",null,null,null,"",null,null,null,"",null,null,null,"",null,null,null,""]
[null,null,null,null,null,null,null,{"$f":"IF(G229=\"\",\"\",D229)","v":""},null,null,null,{"$f":"IF(K229=\"\",\"\",D229)","v":""},null,null,null,{"$f":"IF(O229=\"\",\"\",D229)","v":""},null,null,null,{"$f":"IF(S229=\"\",\"\",D229)","v":""},null,null,null,{"$f":"IF(W229=\"\",\"\",D229)","v":""}]
[null,null,null,null,null,null,null,"",null,null,null,"",null,null,null,"",null,null,null,"",null,null,null,""]
[null,null,null,null,null,null,null,"",null,null,null,"",null,null,null,"",null,null,null,"",null,null,null,""]
[null,null,null,null,null,null,null,"",null,null,null,"",null,null,null,"",null,null,null,"",null,null,null,""]
[null,null,null,null,null,null,null,"",null,null,null,"",null,null,null,"",null,null,null,"",null,null,null,""]
[null,null,null,null,null,null,null,"",null,null,null,"",null,null,null,"",null,null,null,"",null,null,null,""]
[null,null,null,null,null,null,null,"",null,null,null,"",null,null,null,"",null,null,null,"",null,null,null,""]
[null,null,null,null,null,null,null,"",null,null,null,"",null,null,null,"",null,null,null,"",null,null,null,""]
[null,null,null,null,null,null,null,"",null,null,null,"",null,null,null,"",null,null,null,"",null,null,null,""]
[null,null,null,null,null,null,null,"",null,null,null,"",null,null,null,"",null,null,null,"",null,null,null,""]
[null,null,null,null,null,null,null,"",null,null,null,"",null,null,null,"",null,null,null,"",null,null,null,""]
[null,null,null,null,null,null,null,"",null,null,null,"",null,null,null,"",null,null,null,"",null,null,null,""]
[null,null,null,null,null,null,null,"",null,null,null,"",null,null,null,"",null,null,null,"",null,null,null,""]
[null,null,null,null,null,null,null,"",null,null,null,"",null,null,null,"",null,null,null,"",null,null,null,""]
[null,null,null,null,null,null,null,"",null,null,null,"",null,null,null,"",null,null,null,"",null,null,null,""]
[null,null,null,null,null,null,null,"",null,null,null,"",null,null,null,"",null,null,null,"",null,null,null,""]
[null,null,null,null,null,null,null,"",null,null,null,"",null,null,null,"",null,null,null,"",null,null,null,""]
[null,null,null,null,null,null,null,"",null,null,null,"",null,null,null,"",null,null,null,"",null,null,null,""]
[null,null,null,null,null,null,null,"",null,null,null,"",null,null,null,"",null,null,null,"",null,null,null,""]
[null,null,null,null,null,null,null,"",null,null,null,"",null,null,null,"",null,null,null,"",null,null,null,""]
[null,null,null,null,null,null,null,"",null,null,null,"",null,null,null,"",null,null,null,"",null,null,null,""]
[null,null,null,null,null,null,null,"",null,null,null,"",null,null,null,"",null,null,null,"",null,null,null,""]
[null,null,null,null,null,null,null,"",null,null,null,"",null,null,null,"",null,null,null,"",null,null,null,""]
[null,null,null,null,null,null,null,"",null,null,null,"",null,null,null,"",null,null,null,"",null,null,null,""]
[null,null,null,null,null,null,null,"",null,null,null,"",null,null,null,"",null,null,null,"",null,null,null,""]
[null,null,null,null,null,null,null,"",null,null,null,"",null,null,null,"",null,null,null,"",null,null,null,""]
[null,null,null,null,null,null,null,"",null,null,null,"",null,null,null,"",null,null,null,"",null,null,null,""]
[null,null,null,null,null,null,null,"",null,null,null,"",null,null,null,"",null,null,null,"",null,null,null,""]
[null,null,null,null,null,null,null,"",null,null,null,"",null,null,null,"",null,null,null,"",null,null,null,""]
[null,null,null,null,null,null,null,"",null,null,null,"",null,null,null,"",null,null,null,"",null,null,null,""]
[null,null,null,null,null,null,null,"",null,null,null,"",null,null,null,"",null,null,null,"",null,null,null,""]
[null,null,null,null,null,null,null,"",null,null,null,"",null,null,null,"",null,null,null,"",null,null,null,""]
[null,null,null,null,null,null,null,"",null,null,null,"",null,null,null,"",null,null,null,"",null,null,null,""]
[null,null,null,null,null,null,null,"",null,null,null,"",null,null,null,"",null,null,null,"",null,null,null,""]
[null,null,null,null,null,null,null,"",null,null,null,"",null,null,null,"",null,null,null,"",null,null,null,""]
[null,null,null,null,null,null,null,"",null,null,null,"",null,null,null,"",null,null,null,"",null,null,null,""]
[null,null,null,null,null,null,null,"",null,null,null,"",null,null,null,"",null,null,null,"",null,null,null,""]
[null,null,null,null,null,null,null,"",null,null,null,"",null,null,null,"",null,null,null,"",null,null,null,""]
[null,null,null,null,null,null,null,"",null,null,null,"",null,null,null,"",null,null,null,"",null,null,null,""]
[null,null,null,null,null,null,null,"",null,null,null,"",null,null,null,"",null,null,null,"",null,null,null,""]
[null,null,null,null,null,null,null,"",null,null,null,"",null,null,null,"",null,null,null,"",null,null,null,""]
[null,null,null,null,null,null,null,"",null,null,null,"",null,null,null,"",null,null,null,"",null,null,null,""]
[null,null,null,null,null,null,null,"",null,null,null,"",null,null,null,"",null,null,null,"",null,null,null,""]
[null,null,null,null,null,null,null,"",null,null,null,"",null,null,null,"",null,null,null,"",null,null,null,""]
[null,null,null,null,null,null,null,"",null,null,null,"",null,null,null,"",null,null,null,"",null,null,null,""]
[null,null,null,null,null,null,null,"",null,null,null,"",null,null,null,"",null,null,null,"",null,null,null,""]
[null,null,null,null,null,null,null,"",null,null,null,"",null,null,null,"",null,null,null,"",null,null,null,""]
[null,null,null,null,null,null,null,"",null,null,null,"",null,null,null,"",null,null,null,"",null,null,null,""]
[null,null,null,null,null,null,null,"",null,null,null,"",null,null,null,"",null,null,null,"",null,null,null,""]
[null,null,null,null,null,null,null,"",null,null,null,"",null,null,null,"",null,null,null,"",null,null,null,""]
[null,null,null,null,null,null,null,"",null,null,null,"",null,null,null,"",null,null,null,"",null,null,null,""]
[null,null,null,null,null,null,null,"",null,null,null,"",null,null,null,"",null,null,null,"",null,null,null,""]
[null,null,null,null,null,null,null,"",null,null,null,"",null,null,null,"",null,null,null,"",null,null,null,""]
[null,null,null,null,null,null,null,"",null,null,null,"",null,null,null,"",null,null,null,"",null,null,null,""]
[null,null,null,null,null,null,null,"",null,null,null,"",null,null,null,"",null,null,null,"",null,null,null,""]
[null,null,null,null,null,null,null,"",null,null,null,"",null,null,null,"",null,null,null,"",null,null,null,""]
[null,null,null,null,null,null,null,"",null,null,null,"",null,null,null,"",null,null,null,"",null,null,null,""]
[null,null,null,null,null,null,null,"",null,null,null,"",null,null,null,"",null,null,null,"",null,null,null,""]
[null,null,null,null,null,null,null,"",null,null,null,"",null,null,null,"",null,null,null,"",null,null,null,""]
[null,null,null,null,null,null,null,"",null,null,null,"",null,null,null,"",null,null,null,"",null,null,null,""]
[null,null,null,null,null,null,null,"",null,null,null,"",null,null,null,"",null,null,null,"",null,null,null,""]
[null,null,null,null,null,null,null,"",null,null,null,"",null,null,null,"",null,null,null,"",null,null,null,""]
[null,null,null,null,null,null,null,"",null,null,null,"",null,null,null,"",null,null,null,"",null,null,null,""]
[null,null,null,null,null,null,null,"",null,null,null,"",null,null,null,"",null,null,null,"",null,null,null,""]
[null,null,null,null,null,null,null,{"$f":"IF(G293=\"\",\"\",D293)","v":""},null,null,null,{"$f":"IF(K293=\"\",\"\",D293)","v":""},null,null,null,{"$f":"IF(O293=\"\",\"\",D293)","v":""},null,null,null,{"$f":"IF(S293=\"\",\"\",D293)","v":""},null,null,null,{"$f":"IF(W293=\"\",\"\",D293)","v":""}]
[null,null,null,null,null,null,null,"",null,null,null,"",null,null,null,"",null,null,null,"",null,null,null,""]
[null,null,null,null,null,null,null,"",null,null,null,"",null,null,null,"",null,null,null,"",null,null,null,""]
[null,null,null,null,null,null,null,"",null,null,null,"",null,null,null,"",null,null,null,"",null,null,null,""]
[null,null,null,null,null,null,null,"",null,null,null,"",null,null,null,"",null,null,null,"",null,null,null,""]
[null,null,null,null,null,null,null,"",null,null,null,"",null,null,null,"",null,null,null,"",null,null,null,""]
[null,null,null,null,null,null,null,"",null,null,null,"",null,null,null,"",null,null,null,"",null,null,null,""]
[null,null,null,null,null,null,null,"",null,null,null,"",null,null,null,"",null,null,null,"",null,null,null,""]
[null,null,null,null,null,null,null,"",null,null,null,"",null,null,null,"",null,null,null,"",null,null,null,""]
[null,null,null,null,null,null,null,"",null,null,null,"",null,null,null,"",null,null,null,"",null,null,null,""]
[null,null,null,null,null,null,null,"",null,null,null,"",null,null,null,"",null,null,null,"",null,null,null,""]
[null,null,null,null,null,null,null,"",null,null,null,"",null,null,null,"",null,null,null,"",null,null,null,""]
[null,null,null,null,null,null,null,"",null,null,null,"",null,null,null,"",null,null,null,"",null,null,null,""]
[null,null,null,null,null,null,null,"",null,null,null,"",null,null,null,"",null,null,null,"",null,null,null,""]
[null,null,null,null,null,null,null,"",null,null,null,"",null,null,null,"",null,null,null,"",null,null,null,""]
[null,null,null,null,null,null,null,"",null,null,null,"",null,null,null,"",null,null,null,"",null,null,null,""]
[null,null,null,null,null,null,null,"",null,null,null,"",null,null,null,"",null,null,null,"",null,null,null,""]
[null,null,null,null,null,null,null,"",null,null,null,"",null,null,null,"",null,null,null,"",null,null,null,""]
[null,null,null,null,null,null,null,"",null,null,null,"",null,null,null,"",null,null,null,"",null,null,null,""]
[null,null,null,null,null,null,null,"",null,null,null,"",null,null,null,"",null,null,null,"",null,null,null,""]
[null,null,null,null,null,null,null,"",null,null,null,"",null,null,null,"",null,null,null,"",null,null,null,""]
[null,null,null,null,null,null,null,"",null,null,null,"",null,null,null,"",null,null,null,"",null,null,null,""]
[null,null,null,null,null,null,null,"",null,null,null,"",null,null,null,"",null,null,null,"",null,null,null,""]
[null,null,null,null,null,null,null,"",null,null,null,"",null,null,null,"",null,null,null,"",null,null,null,""]
[null,null,null,null,null,null,null,"",null,null,null,"",null,null,null,"",null,null,null,"",null,null,null,""]
[null,null,null,null,null,null,null,"",null,null,null,"",null,null,null,"",null,null,null,"",null,null,null,""]
[null,null,null,null,null,null,null,"",null,null,null,"",null,null,null,"",null,null,null,"",null,null,null,""]
[null,null,null,null,null,null,null,"",null,null,null,"",null,null,null,"",null,null,null,"",null,null,null,""]
[null,null,null,null,null,null,null,"",null,null,null,"",null,null,null,"",null,null,null,"",null,null,null,""]
[null,null,null,null,null,null,null,"",null,null,null,"",null,null,null,"",null,null,null,"",null,null,null,""]
[null,null,null,null,null,null,null,"",null,null,null,"",null,null,null,"",null,null,null,"",null,null,null,""]
[null,null,null,null,null,null,null,"",null,null,null,"",null,null,null,"",null,null,null,"",null,null,null,""]
[null,null,null,null,null,null,null,"",null,null,null,"",null,null,null,"",null,null,null,"",null,null,null,""]
[null,null,null,null,null,null,null,"",null,null,null,"",null,null,null,"",null,null,null,"",null,null,null,""]
[null,null,null,null,null,null,null,"",null,null,null,"",null,null,null,"",null,null,null,"",null,null,null,""]
[null,null,null,null,null,null,null,"",null,null,null,"",null,null,null,"",null,null,null,"",null,null,null,""]
[null,null,null,null,null,null,null,"",null,null,null,"",null,null,null,"",null,null,null,"",null,null,null,""]
[null,null,null,null,null,null,null,"",null,null,null,"",null,null,null,"",null,null,null,"",null,null,null,""]
[null,null,null,null,null,null,null,"",null,null,null,"",null,null,null,"",null,null,null,"",null,null,null,""]
[null,null,null,null,null,null,null,"",null,null,null,"",null,null,null,"",null,null,null,"",null,null,null,""]
[null,null,null,null,null,null,null,"",null,null,null,"",null,null,null,"",null,null,null,"",null,null,null,""]
[null,null,null,null,null,null,null,"",null,null,null,"",null,null,null,"",null,null,null,"",null,null,null,""]
[null,null,null,null,null,null,null,"",null,null,null,"",null,null,null,"",null,null,null,"",null,null,null,""]
[null,null,null,null,null,null,null,"",null,null,null,"",null,null,null,"",null,null,null,"",null,null,null,""]
[null,null,null,null,null,null,null,"",null,null,null,"",null,null,null,"",null,null,null,"",null,null,null,""]
[null,null,null,null,null,null,null,"",null,null,null,"",null,null,null,"",null,null,null,"",null,null,null,""]
[null,null,null,null,null,null,null,"",null,null,null,"",null,null,null,"",null,null,null,"",null,null,null,""]
[null,null,null,null,null,null,null,"",null,null,null,"",null,null,null,"",null,null,null,"",null,null,null,""]
[null,null,null,null,null,null,null,"",null,null,null,"",null,null,null,"",null,null,null,"",null,null,null,""]
[null,null,null,null,null,null,null,"",null,null,null,"",null,null,null,"",null,null,null,"",null,null,null,""]
[null,null,null,null,null,null,null,"",null,null,null,"",null,null,null,"",null,null,null,"",null,null,null,""]
[null,null,null,null,null,null,null,"",null,null,null,"",null,null,null,"",null,null,null,"",null,null,null,""]
[null,null,null,null,null,null,null,"",null,null,null,"",null,null,null,"",null,null,null,"",null,null,null,""]
[null,null,null,null,null,null,null,"",null,null,null,"",null,null,null,"",null,null,null,"",null,null,null,""]
[null,null,null,null,null,null,null,"",null,null,null,"",null,null,null,"",null,null,null,"",null,null,null,""]
[null,null,null,null,null,null,null,"",null,null,null,"",null,null,null,"",null,null,null,"",null,null,null,""]
[null,null,null,null,null,null,null,"",null,null,null,"",null,null,null,"",null,null,null,"",null,null,null,""]
[null,null,null,null,null,null,null,"",null,null,null,"",null,null,null,"",null,null,null,"",null,null,null,""]
[null,null,null,null,null,null,null,"",null,null,null,"",null,null,null,"",null,null,null,"",null,null,null,""]
[null,null,null,null,null,null,null,"",null,null,null,"",null,null,null,"",null,null,null,"",null,null,null,""]
[null,null,null,null,null,null,null,"",null,null,null,"",null,null,null,"",null,null,null,"",null,null,null,""]
[null,null,null,null,null,null,null,"",null,null,null,"",null,null,null,"",null,null,null,"",null,null,null,""]
[null,null,null,null,null,null,null,"",null,null,null,"",null,null,null,"",null,null,null,"",null,null,null,""]
[null,null,null,null,null,null,null,"",null,null,null,"",null,null,null,"",null,null,null,"",null,null,null,""]
[null,null,null,null,null,null,null,{"$f":"IF(G357=\"\",\"\",D357)","v":""},null,null,null,{"$f":"IF(K357=\"\",\"\",D357)","v":""},null,null,null,{"$f":"IF(O357=\"\",\"\",D357)","v":""},null,null,null,{"$f":"IF(S357=\"\",\"\",D357)","v":""},null,null,null,{"$f":"IF(W357=\"\",\"\",D357)","v":""}]
[null,null,null,null,null,null,null,"",null,null,null,"",null,null,null,"",null,null,null,"",null,null,null,""]
[null,null,null,null,null,null,null,"",null,null,null,"",null,null,null,"",null,null,null,"",null,null,null,""]
[null,null,null,null,null,null,null,"",null,null,null,"",null,null,null,"",null,null,null,"",null,null,null,""]
[null,null,null,null,null,null,null,"",null,null,null,"",null,null,null,"",null,null,null,"",null,null,null,""]
[null,null,null,null,null,null,null,"",null,null,null,"",null,null,null,"",null,null,null,"",null,null,null,""]
[null,null,null,null,null,null,null,"",null,null,null,"",null,null,null,"",null,null,null,"",null,null,null,""]
[null,null,null,null,null,null,null,"",null,null,null,"",null,null,null,"",null,null,null,"",null,null,null,""]
[null,null,null,null,null,null,null,"",null,null,null,"",null,null,null,"",null,null,null,"",null,null,null,""]
[null,null,null,null,null,null,null,"",null,null,null,"",null,null,null,"",null,null,null,"",null,null,null,""]
[null,null,null,null,null,null,null,"",null,null,null,"",null,null,null,"",null,null,null,"",null,null,null,""]
[null,null,null,null,null,null,null,"",null,null,null,"",null,null,null,"",null,null,null,"",null,null,null,""]
[null,null,null,null,null,null,null,"",null,null,null,"",null,null,null,"",null,null,null,"",null,null,null,""]
[null,null,null,null,null,null,null,"",null,null,null,"",null,null,null,"",null,null,null,"",null,null,null,""]
[null,null,null,null,null,null,null,"",null,null,null,"",null,null,null,"",null,null,null,"",null,null,null,""]
[null,null,null,null,null,null,null,"",null,null,null,"",null,null,null,"",null,null,null,"",null,null,null,""]
[null,null,null,null,null,null,null,"",null,null,null,"",null,null,null,"",null,null,null,"",null,null,null,""]
[null,null,null,null,null,null,null,"",null,null,null,"",null,null,null,"",null,null,null,"",null,null,null,""]
[null,null,null,null,null,null,null,"",null,null,null,"",null,null,null,"",null,null,null,"",null,null,null,""]
[null,null,null,null,null,null,null,"",null,null,null,"",null,null,null,"",null,null,null,"",null,null,null,""]
[null,null,null,null,null,null,null,"",null,null,null,"",null,null,null,"",null,null,null,"",null,null,null,""]
[null,null,null,null,null,null,null,"",null,null,null,"",null,null,null,"",null,null,null,"",null,null,null,""]
[null,null,null,null,null,null,null,"",null,null,null,"",null,null,null,"",null,null,null,"",null,null,null,""]
[null,null,null,null,null,null,null,"",null,null,null,"",null,null,null,"",null,null,null,"",null,null,null,""]
[null,null,null,null,null,null,null,"",null,null,null,"",null,null,null,"",null,null,null,"",null,null,null,""]
[null,null,null,null,null,null,null,"",null,null,null,"",null,null,null,"",null,null,null,"",null,null,null,""]
[null,null,null,null,null,null,null,"",null,null,null,"",null,null,null,"",null,null,null,"",null,null,null,""]
[null,null,null,null,null,null,null,"",null,null,null,"",null,null,null,"",null,null,null,"",null,null,null,""]
[null,null,null,null,null,null,null,"",null,null,null,"",null,null,null,"",null,null,null,"",null,null,null,""]
[null,null,null,null,null,null,null,"",null,null,null,"",null,null,null,"",null,null,null,"",null,null,null,""]
[null,null,null,null,null,null,null,"",null,null,null,"",null,null,null,"",null,null,null,"",null,null,null,""]
[null,null,null,null,null,null,null,"",null,null,null,"",null,null,null,"",null,null,null,"",null,null,null,""]
[null,null,null,null,null,null,null,"",null,null,null,"",null,null,null,"",null,null,null,"",null,null,null,""]
[null,null,null,null,null,null,null,"",null,null,null,"",null,null,null,"",null,null,null,"",null,null,null,""]
[null,null,null,null,null,null,null,"",null,null,null,"",null,null,null,"",null,null,null,"",null,null,null,""]
[null,null,null,null,null,null,null,"",null,null,null,"",null,null,null,"",null,null,null,"",null,null,null,""]
[null,null,null,null,null,null,null,"",null,null,null,"",null,null,null,"",null,null,null,"",null,null,null,""]
[null,null,null,null,null,null,null,"",null,null,null,"",null,null,null,"",null,null,null,"",null,null,null,""]
[null,null,null,null,null,null,null,"",null,null,null,"",null,null,null,"",null,null,null,"",null,null,null,""]
[null,null,null,null,null,null,null,"",null,null,null,"",null,null,null,"",null,null,null,"",null,null,null,""]
[null,null,null,null,null,null,null,"",null,null,null,"",null,null,null,"",null,null,null,"",null,null,null,""]
[null,null,null,null,null,null,null,"",null,null,null,"",null,null,null,"",null,null,null,"",null,null,null,""]
[null,null,null,null,null,null,null,"",null,null,null,"",null,null,null,"",null,null,null,"",null,null,null,""]
[null,null,null,null,null,null,null,"",null,null,null,"",null,null,null,"",null,null,null,"",null,null,null,""]
[null,null,null,null,null,null,null,"",null,null,null,"",null,null,null,"",null,null,null,"",null,null,null,""]
[null,null,null,null,null,null,null,"",null,null,null,"",null,null,null,"",null,null,null,"",null,null,null,""]
[null,null,null,null,null,null,null,"",null,null,null,"",null,null,null,"",null,null,null,"",null,null,null,""]
[null,null,null,null,null,null,null,"",null,null,null,"",null,null,null,"",null,null,null,"",null,null,null,""]
[null,null,null,null,null,null,null,"",null,null,null,"",null,null,null,"",null,null,null,"",null,null,null,""]
[null,null,null,null,null,null,null,"",null,null,null,"",null,null,null,"",null,null,null,"",null,null,null,""]
[null,null,null,null,null,null,null,"",null,null,null,"",null,null,null,"",null,null,null,"",null,null,null,""]
[null,null,null,null,null,null,null,"",null,null,null,"",null,null,null,"",null,null,null,"",null,null,null,""]
[null,null,null,null,null,null,null,"",null,null,null,"",null,null,null,"",null,null,null,"",null,null,null,""]
[null,null,null,null,null,null,null,"",null,null,null,"",null,null,null,"",null,null,null,"",null,null,null,""]
[null,null,null,null,null,null,null,"",null,null,null,"",null,null,null,"",null,null,null,"",null,null,null,""]
[null,null,null,null,null,null,null,"",null,null,null,"",null,null,null,"",null,null,null,"",null,null,null,""]
[null,null,null,null,null,null,null,"",null,null,null,"",null,null,null,"",null,null,null,"",null,null,null,""]
[null,null,null,null,null,null,null,"",null,null,null,"",null,null,null,"",null,null,null,"",null,null,null,""]
[null,null,null,null,null,null,null,"",null,null,null,"",null,null,null,"",null,null,null,"",null,null,null,""]
[null,null,null,null,null,null,null,"",null,null,null,"",null,null,null,"",null,null,null,"",null,null,null,""]
[null,null,null,null,null,null,null,"",null,null,null,"",null,null,null,"",null,null,null,"",null,null,null,""]
[null,null,null,null,null,null,null,"",null,null,null,"",null,null,null,"",null,null,null,"",null,null,null,""]
[null,null,null,null,null,null,null,"",null,null,null,"",null,null,null,"",null,null,null,"",null,null,null,""]
[null,null,null,null,null,null,null,"",null,null,null,"",null,null,null,"",null,null,null,"",null,null,null,""]
[null,null,null,null,null,null,null,{"$f":"IF(G421=\"\",\"\",D421)","v":""},null,null,null,{"$f":"IF(K421=\"\",\"\",D421)","v":""},null,null,null,{"$f":"IF(O421=\"\",\"\",D421)","v":""},null,null,null,{"$f":"IF(S421=\"\",\"\",D421)","v":""},null,null,null,{"$f":"IF(W421=\"\",\"\",D421)","v":""}]
[null,null,null,null,null,null,null,"",null,null,null,"",null,null,null,"",null,null,null,"",null,null,null,""]
[null,null,null,null,null,null,null,"",null,null,null,"",null,null,null,"",null,null,null,"",null,null,null,""]
[null,null,null,null,null,null,null,"",null,null,null,"",null,null,null,"",null,null,null,"",null,null,null,""]
[null,null,null,null,null,null,null,"",null,null,null,"",null,null,null,"",null,null,null,"",null,null,null,""]
[null,null,null,null,null,null,null,"",null,null,null,"",null,null,null,"",null,null,null,"",null,null,null,""]
[null,null,null,null,null,null,null,"",null,null,null,"",null,null,null,"",null,null,null,"",null,null,null,""]
[null,null,null,null,null,null,null,"",null,null,null,"",null,null,null,"",null,null,null,"",null,null,null,""]
[null,null,null,null,null,null,null,"",null,null,null,"",null,null,null,"",null,null,null,"",null,null,null,""]
[null,null,null,null,null,null,null,"",null,null,null,"",null,null,null,"",null,null,null,"",null,null,null,""]
[null,null,null,null,null,null,null,"",null,null,null,"",null,null,null,"",null,null,null,"",null,null,null,""]
[null,null,null,null,null,null,null,"",null,null,null,"",null,null,null,"",null,null,null,"",null,null,null,""]
[null,null,null,null,null,null,null,"",null,null,null,"",null,null,null,"",null,null,null,"",null,null,null,""]
[null,null,null,null,null,null,null,"",null,null,null,"",null,null,null,"",null,null,null,"",null,null,null,""]
[null,null,null,null,null,null,null,"",null,null,null,"",null,null,null,"",null,null,null,"",null,null,null,""]
[null,null,null,null,null,null,null,"",null,null,null,"",null,null,null,"",null,null,null,"",null,null,null,""]
[null,null,null,null,null,null,null,"",null,null,null,"",null,null,null,"",null,null,null,"",null,null,null,""]
[null,null,null,null,null,null,null,"",null,null,null,"",null,null,null,"",null,null,null,"",null,null,null,""]
[null,null,null,null,null,null,null,"",null,null,null,"",null,null,null,"",null,null,null,"",null,null,null,""]
[null,null,null,null,null,null,null,"",null,null,null,"",null,null,null,"",null,null,null,"",null,null,null,""]
[null,null,null,null,null,null,null,"",null,null,null,"",null,null,null,"",null,null,null,"",null,null,null,""]
[null,null,null,null,null,null,null,"",null,null,null,"",null,null,null,"",null,null,null,"",null,null,null,""]
[null,null,null,null,null,null,null,"",null,null,null,"",null,null,null,"",null,null,null,"",null,null,null,""]
[null,null,null,null,null,null,null,"",null,null,null,"",null,null,null,"",null,null,null,"",null,null,null,""]
[null,null,null,null,null,null,null,"",null,null,null,"",null,null,null,"",null,null,null,"",null,null,null,""]
[null,null,null,null,null,null,null,"",null,null,null,"",null,null,null,"",null,null,null,"",null,null,null,""]
[null,null,null,null,null,null,null,"",null,null,null,"",null,null,null,"",null,null,null,"",null,null,null,""]
[null,null,null,null,null,null,null,"",null,null,null,"",null,null,null,"",null,null,null,"",null,null,null,""]
[null,null,null,null,null,null,null,"",null,null,null,"",null,null,null,"",null,null,null,"",null,null,null,""]
[null,null,null,null,null,null,null,"",null,null,null,"",null,null,null,"",null,null,null,"",null,null,null,""]
[null,null,null,null,null,null,null,"",null,null,null,"",null,null,null,"",null,null,null,"",null,null,null,""]
[null,null,null,null,null,null,null,"",null,null,null,"",null,null,null,"",null,null,null,"",null,null,null,""]
[null,null,null,null,null,null,null,"",null,null,null,"",null,null,null,"",null,null,null,"",null,null,null,""]
[null,null,null,null,null,null,null,"",null,null,null,"",null,null,null,"",null,null,null,"",null,null,null,""]
[null,null,null,null,null,null,null,"",null,null,null,"",null,null,null,"",null,null,null,"",null,null,null,""]
[null,null,null,null,null,null,null,"",null,null,null,"",null,null,null,"",null,null,null,"",null,null,null,""]
[null,null,null,null,null,null,null,"",null,null,null,"",null,null,null,"",null,null,null,"",null,null,null,""]
[null,null,null,null,null,null,null,"",null,null,null,"",null,null,null,"",null,null,null,"",null,null,null,""]
[null,null,null,null,null,null,null,"",null,null,null,"",null,null,null,"",null,null,null,"",null,null,null,""]
[null,null,null,null,null,null,null,"",null,null,null,"",null,null,null,"",null,null,null,"",null,null,null,""]
[null,null,null,null,null,null,null,"",null,null,null,"",null,null,null,"",null,null,null,"",null,null,null,""]
[null,null,null,null,null,null,null,"",null,null,null,"",null,null,null,"",null,null,null,"",null,null,null,""]
[null,null,null,null,null,null,null,"",null,null,null,"",null,null,null,"",null,null,null,"",null,null,null,""]
[null,null,null,null,null,null,null,"",null,null,null,"",null,null,null,"",null,null,null,"",null,null,null,""]
[null,null,null,null,null,null,null,"",null,null,null,"",null,null,null,"",null,null,null,"",null,null,null,""]
[null,null,null,null,null,null,null,"",null,null,null,"",null,null,null,"",null,null,null,"",null,null,null,""]
[null,null,null,null,null,null,null,"",null,null,null,"",null,null,null,"",null,null,null,"",null,null,null,""]
[null,null,null,null,null,null,null,"",null,null,null,"",null,null,null,"",null,null,null,"",null,null,null,""]
[null,null,null,null,null,null,null,"",null,null,null,"",null,null,null,"",null,null,null,"",null,null,null,""]
[null,null,null,null,null,null,null,"",null,null,null,"",null,null,null,"",null,null,null,"",null,null,null,""]
[null,null,null,null,null,null,null,"",null,null,null,"",null,null,null,"",null,null,null,"",null,null,null,""]
[null,null,null,null,null,null,null,"",null,null,null,"",null,null,null,"",null,null,null,"",null,null,null,""]
[null,null,null,null,null,null,null,"",null,null,null,"",null,null,null,"",null,null,null,"",null,null,null,""]
[null,null,null,null,null,null,null,"",null,null,null,"",null,null,null,"",null,null,null,"",null,null,null,""]
[null,null,null,null,null,null,null,"",null,null,null,"",null,null,null,"",null,null,null,"",null,null,null,""]
[null,null,null,null,null,null,null,"",null,null,null,"",null,null,null,"",null,null,null,"",null,null,null,""]
[null,null,null,null,null,null,null,"",null,null,null,"",null,null,null,"",null,null,null,"",null,null,null,""]
[null,null,null,null,null,null,null,"",null,null,null,"",null,null,null,"",null,null,null,"",null,null,null,""]
[null,null,null,null,null,null,null,"",null,null,null,"",null,null,null,"",null,null,null,"",null,null,null,""]
[null,null,null,null,null,null,null,"",null,null,null,"",null,null,null,"",null,null,null,"",null,null,null,""]
[null,null,null,null,null,null,null,"",null,null,null,"",null,null,null,"",null,null,null,"",null,null,null,""]
[null,null,null,null,null,null,null,"",null,null,null,"",null,null,null,"",null,null,null,"",null,null,null,""]
[null,null,null,null,null,null,null,"",null,null,null,"",null,null,null,"",null,null,null,"",null,null,null,""]
[null,null,null,null,null,null,null,"",null,null,null,"",null,null,null,"",null,null,null,"",null,null,null,""]
[null,null,null,null,null,null,null,{"$f":"IF(G485=\"\",\"\",D485)","v":""},null,null,null,{"$f":"IF(K485=\"\",\"\",D485)","v":""},null,null,null,{"$f":"IF(O485=\"\",\"\",D485)","v":""},null,null,null,{"$f":"IF(S485=\"\",\"\",D485)","v":""},null,null,null,{"$f":"IF(W485=\"\",\"\",D485)","v":""}]
[null,null,null,null,null,null,null,"",null,null,null,"",null,null,null,"",null,null,null,"",null,null,null,""]
[null,null,null,null,null,null,null,"",null,null,null,"",null,null,null,"",null,null,null,"",null,null,null,""]
[null,null,null,null,null,null,null,"",null,null,null,"",null,null,null,"",null,null,null,"",null,null,null,""]
[null,null,null,null,null,null,null,"",null,null,null,"",null,null,null,"",null,null,null,"",null,null,null,""]
[null,null,null,null,null,null,null,"",null,null,null,"",null,null,null,"",null,null,null,"",null,null,null,""]
[null,null,null,null,null,null,null,"",null,null,null,"",null,null,null,"",null,null,null,"",null,null,null,""]
[null,null,null,null,null,null,null,"",null,null,null,"",null,null,null,"",null,null,null,"",null,null,null,""]
[null,null,null,null,null,null,null,"",null,null,null,"",null,null,null,"",null,null,null,"",null,null,null,""]
[null,null,null,null,null,null,null,"",null,null,null,"",null,null,null,"",null,null,null,"",null,null,null,""]
[null,null,null,null,null,null,null,"",null,null,null,"",null,null,null,"",null,null,null,"",null,null,null,""]
[null,null,null,null,null,null,null,"",null,null,null,"",null,null,null,"",null,null,null,"",null,null,null,""]
[null,null,null,null,null,null,null,"",null,null,null,"",null,null,null,"",null,null,null,"",null,null,null,""]
[null,null,null,null,null,null,null,"",null,null,null,"",null,null,null,"",null,null,null,"",null,null,null,""]
[null,null,null,null,null,null,null,"",null,null,null,"",null,null,null,"",null,null,null,"",null,null,null,""]
[null,null,null,null,null,null,null,"",null,null,null,"",null,null,null,"",null,null,null,"",null,null,null,""]
[null,null,null,null,null,null,null,"",null,null,null,"",null,null,null,"",null,null,null,"",null,null,null,""]
[null,null,null,null,null,null,null,"",null,null,null,"",null,null,null,"",null,null,null,"",null,null,null,""]
[null,null,null,null,null,null,null,"",null,null,null,"",null,null,null,"",null,null,null,"",null,null,null,""]
[null,null,null,null,null,null,null,"",null,null,null,"",null,null,null,"",null,null,null,"",null,null,null,""]
[null,null,null,null,null,null,null,"",null,null,null,"",null,null,null,"",null,null,null,"",null,null,null,""]
[null,null,null,null,null,null,null,"",null,null,null,"",null,null,null,"",null,null,null,"",null,null,null,""]
[null,null,null,null,null,null,null,"",null,null,null,"",null,null,null,"",null,null,null,"",null,null,null,""]
[null,null,null,null,null,null,null,"",null,null,null,"",null,null,null,"",null,null,null,"",null,null,null,""]
[null,null,null,null,null,null,null,"",null,null,null,"",null,null,null,"",null,null,null,"",null,null,null,""]
[null,null,null,null,null,null,null,"",null,null,null,"",null,null,null,"",null,null,null,"",null,null,null,""]
[null,null,null,null,null,null,null,"",null,null,null,"",null,null,null,"",null,null,null,"",null,null,null,""]
[null,null,null,null,null,null,null,"",null,null,null,"",null,null,null,"",null,null,null,"",null,null,null,""]
[null,null,null,null,null,null,null,"",null,null,null,"",null,null,null,"",null,null,null,"",null,null,null,""]
[null,null,null,null,null,null,null,"",null,null,null,"",null,null,null,"",null,null,null,"",null,null,null,""]
[null,null,null,null,null,null,null,"",null,null,null,"",null,null,null,"",null,null,null,"",null,null,null,""]
[null,null,null,null,null,null,null,"",null,null,null,"",null,null,null,"",null,null,null,"",null,null,null,""]
[null,null,null,null,null,null,null,"",null,null,null,"",null,null,null,"",null,null,null,"",null,null,null,""]
[null,null,null,null,null,null,null,"",null,null,null,"",null,null,null,"",null,null,null,"",null,null,null,""]
[null,null,null,null,null,null,null,"",null,null,null,"",null,null,null,"",null,null,null,"",null,null,null,""]
[null,null,null,null,null,null,null,"",null,null,null,"",null,null,null,"",null,null,null,"",null,null,null,""]
[null,null,null,null,null,null,null,"",null,null,null,"",null,null,null,"",null,null,null,"",null,null,null,""]
[null,null,null,null,null,null,null,"",null,null,null,"",null,null,null,"",null,null,null,"",null,null,null,""]
[null,null,null,null,null,null,null,"",null,null,null,"",null,null,null,"",null,null,null,"",null,null,null,""]
[null,null,null,null,null,null,null,"",null,null,null,"",null,null,null,"",null,null,null,"",null,null,null,""]
[null,null,null,null,null,null,null,"",null,null,null,"",null,null,null,"",null,null,null,"",null,null,null,""]
[null,null,null,null,null,null,null,"",null,null,null,"",null,null,null,"",null,null,null,"",null,null,null,""]
[null,null,null,null,null,null,null,"",null,null,null,"",null,null,null,"",null,null,null,"",null,null,null,""]
[null,null,null,null,null,null,null,"",null,null,null,"",null,null,null,"",null,null,null,"",null,null,null,""]
[null,null,null,null,null,null,null,"",null,null,null,"",null,null,null,"",null,null,null,"",null,null,null,""]
[null,null,null,null,null,null,null,"",null,null,null,"",null,null,null,"",null,null,null,"",null,null,null,""]
[null,null,null,null,null,null,null,"",null,null,null,"",null,null,null,"",null,null,null,"",null,null,null,""]
[null,null,null,null,null,null,null,"",null,null,null,"",null,null,null,"",null,null,null,"",null,null,null,""]
[null,null,null,null,null,null,null,"",null,null,null,"",null,null,null,"",null,null,null,"",null,null,null,""]
[null,null,null,null,null,null,null,"",null,null,null,"",null,null,null,"",null,null,null,"",null,null,null,""]
[null,null,null,null,null,null,null,"",null,null,null,"",null,null,null,"",null,null,null,"",null,null,null,""]
[null,null,null,null,null,null,null,"",null,null,null,"",null,null,null,"",null,null,null,"",null,null,null,""]
[null,null,null,null,null,null,null,"",null,null,null,"",null,null,null,"",null,null,null,"",null,null,null,""]
[null,null,null,null,null,null,null,"",null,null,null,"",null,null,null,"",null,null,null,"",null,null,null,""]
[null,null,null,null,null,null,null,"",null,null,null,"",null,null,null,"",null,null,null,"",null,null,null,""]
[null,null,null,null,null,null,null,"",null,null,null,"",null,null,null,"",null,null,null,"",null,null,null,""]
[null,null,null,null,null,null,null,"",null,null,null,"",null,null,null,"",null,null,null,"",null,null,null,""]
[null,null,null,null,null,null,null,"",null,null,null,"",null,null,null,"",null,null,null,"",null,null,null,""]
[null,null,null,null,null,null,null,"",null,null,null,"",null,null,null,"",null,null,null,"",null,null,null,""]
[null,null,null,null,null,null,null,"",null,null,null,"",null,null,null,"",null,null,null,"",null,null,null,""]
[null,null,null,null,null,null,null,"",null,null,null,"",null,null,null,"",null,null,null,"",null,null,null,""]
[null,null,null,null,null,null,null,"",null,null,null,"",null,null,null,"",null,null,null,"",null,null,null,""]
[null,null,null,null,null,null,null,"",null,null,null,"",null,null,null,"",null,null,null,"",null,null,null,""]
[null,null,null,null,null,null,null,"",null,null,null,"",null,null,null,"",null,null,null,"",null,null,null,""]
[null,null,null,null,null,null,null,{"$f":"IF(G549=\"\",\"\",D549)","v":""},null,null,null,{"$f":"IF(K549=\"\",\"\",D549)","v":""},null,null,null,{"$f":"IF(O549=\"\",\"\",D549)","v":""},null,null,null,{"$f":"IF(S549=\"\",\"\",D549)","v":""},null,null,null,{"$f":"IF(W549=\"\",\"\",D549)","v":""}]
[null,null,null,null,null,null,null,"",null,null,null,"",null,null,null,"",null,null,null,"",null,null,null,""]
[null,null,null,null,null,null,null,"",null,null,null,"",null,null,null,"",null,null,null,"",null,null,null,""]
[null,null,null,null,null,null,null,"",null,null,null,"",null,null,null,"",null,null,null,"",null,null,null,""]
[null,null,null,null,null,null,null,"",null,null,null,"",null,null,null,"",null,null,null,"",null,null,null,""]
[null,null,null,null,null,null,null,"",null,null,null,"",null,null,null,"",null,null,null,"",null,null,null,""]
[null,null,null,null,null,null,null,"",null,null,null,"",null,null,null,"",null,null,null,"",null,null,null,""]
[null,null,null,null,null,null,null,"",null,null,null,"",null,null,null,"",null,null,null,"",null,null,null,""]
[null,null,null,null,null,null,null,"",null,null,null,"",null,null,null,"",null,null,null,"",null,null,null,""]
[null,null,null,null,null,null,null,"",null,null,null,"",null,null,null,"",null,null,null,"",null,null,null,""]
[null,null,null,null,null,null,null,"",null,null,null,"",null,null,null,"",null,null,null,"",null,null,null,""]
[null,null,null,null,null,null,null,"",null,null,null,"",null,null,null,"",null,null,null,"",null,null,null,""]
[null,null,null,null,null,null,null,"",null,null,null,"",null,null,null,"",null,null,null,"",null,null,null,""]
[null,null,null,null,null,null,null,"",null,null,null,"",null,null,null,"",null,null,null,"",null,null,null,""]
[null,null,null,null,null,null,null,"",null,null,null,"",null,null,null,"",null,null,null,"",null,null,null,""]
[null,null,null,null,null,null,null,"",null,null,null,"",null,null,null,"",null,null,null,"",null,null,null,""]
[null,null,null,null,null,null,null,"",null,null,null,"",null,null,null,"",null,null,null,"",null,null,null,""]
[null,null,null,null,null,null,null,"",null,null,null,"",null,null,null,"",null,null,null,"",null,null,null,""]
[null,null,null,null,null,null,null,"",null,null,null,"",null,null,null,"",null,null,null,"",null,null,null,""]
[null,null,null,null,null,null,null,"",null,null,null,"",null,null,null,"",null,null,null,"",null,null,null,""]
[null,null,null,null,null,null,null,"",null,null,null,"",null,null,null,"",null,null,null,"",null,null,null,""]
[null,null,null,null,null,null,null,"",null,null,null,"",null,null,null,"",null,null,null,"",null,null,null,""]
[null,null,null,null,null,null,null,"",null,null,null,"",null,null,null,"",null,null,null,"",null,null,null,""]
[null,null,null,null,null,null,null,"",null,null,null,"",null,null,null,"",null,null,null,"",null,null,null,""]
[null,null,null,null,null,null,null,"",null,null,null,"",null,null,null,"",null,null,null,"",null,null,null,""]
[null,null,null,null,null,null,null,"",null,null,null,"",null,null,null,"",null,null,null,"",null,null,null,""]
[null,null,null,null,null,null,null,"",null,null,null,"",null,null,null,"",null,null,null,"",null,null,null,""]
[null,null,null,null,null,null,null,"",null,null,null,"",null,null,null,"",null,null,null,"",null,null,null,""]
[null,null,null,null,null,null,null,"",null,null,null,"",null,null,null,"",null,null,null,"",null,null,null,""]
[null,null,null,null,null,null,null,"",null,null,null,"",null,null,null,"",null,null,null,"",null,null,null,""]
[null,null,null,null,null,null,null,"",null,null,null,"",null,null,null,"",null,null,null,"",null,null,null,""]
[null,null,null,null,null,null,null,"",null,null,null,"",null,null,null,"",null,null,null,"",null,null,null,""]
[null,null,null,null,null,null,null,"",null,null,null,"",null,null,null,"",null,null,null,"",null,null,null,""]
[null,null,null,null,null,null,null,"",null,null,null,"",null,null,null,"",null,null,null,"",null,null,null,""]
[null,null,null,null,null,null,null,"",null,null,null,"",null,null,null,"",null,null,null,"",null,null,null,""]
[null,null,null,null,null,null,null,"",null,null,null,"",null,null,null,"",null,null,null,"",null,null,null,""]
[null,null,null,null,null,null,null,"",null,null,null,"",null,null,null,"",null,null,null,"",null,null,null,""]
[null,null,null,null,null,null,null,"",null,null,null,"",null,null,null,"",null,null,null,"",null,null,null,""]
[null,null,null,null,null,null,null,"",null,null,null,"",null,null,null,"",null,null,null,"",null,null,null,""]
[null,null,null,null,null,null,null,"",null,null,null,"",null,null,null,"",null,null,null,"",null,null,null,""]
[null,null,null,null,null,null,null,"",null,null,null,"",null,null,null,"",null,null,null,"",null,null,null,""]
[null,null,null,null,null,null,null,"",null,null,null,"",null,null,null,"",null,null,null,"",null,null,null,""]
[null,null,null,null,null,null,null,"",null,null,null,"",null,null,null,"",null,null,null,"",null,null,null,""]
[null,null,null,null,null,null,null,"",null,null,null,"",null,null,null,"",null,null,null,"",null,null,null,""]
[null,null,null,null,null,null,null,"",null,null,null,"",null,null,null,"",null,null,null,"",null,null,null,""]
[null,null,null,null,null,null,null,"",null,null,null,"",null,null,null,"",null,null,null,"",null,null,null,""]
[null,null,null,null,null,null,null,"",null,null,null,"",null,null,null,"",null,null,null,"",null,null,null,""]
[null,null,null,null,null,null,null,"",null,null,null,"",null,null,null,"",null,null,null,"",null,null,null,""]
[null,null,null,null,null,null,null,"",null,null,null,"",null,null,null,"",null,null,null,"",null,null,null,""]
[null,null,null,null,null,null,null,"",null,null,null,"",null,null,null,"",null,null,null,"",null,null,null,""]
[null,null,null,null,null,null,null,"",null,null,null,"",null,null,null,"",null,null,null,"",null,null,null,""]
[null,null,null,null,null,null,null,"",null,null,null,"",null,null,null,"",null,null,null,"",null,null,null,""]
[null,null,null,null,null,null,null,"",null,null,null,"",null,null,null,"",null,null,null,"",null,null,null,""]
[null,null,null,null,null,null,null,"",null,null,null,"",null,null,null,"",null,null,null,"",null,null,null,""]
[null,null,null,null,null,null,null,"",null,null,null,"",null,null,null,"",null,null,null,"",null,null,null,""]
[null,null,null,null,null,null,null,"",null,null,null,"",null,null,null,"",null,null,null,"",null,null,null,""]
[null,null,null,null,null,null,null,"",null,null,null,"",null,null,null,"",null,null,null,"",null,null,null,""]
[null,null,null,null,null,null,null,"",null,null,null,"",null,null,null,"",null,null,null,"",null,null,null,""]
[null,null,null,null,null,null,null,"",null,null,null,"",null,null,null,"",null,null,null,"",null,null,null,""]
[null,null,null,null,null,null,null,"",null,null,null,"",null,null,null,"",null,null,null,"",null,null,null,""]
[null,null,null,null,null,null,null,"",null,null,null,"",null,null,null,"",null,null,null,"",null,null,null,""]
[null,null,null,null,null,null,null,"",null,null,null,"",null,null,null,"",null,null,null,"",null,null,null,""]
[null,null,null,null,null,null,null,"",null,null,null,"",null,null,null,"",null,null,null,"",null,null,null,""]
[null,null,null,null,null,null,null,"",null,null,null,"",null,null,null,"",null,null,null,"",null,null,null,""]
[null,null,null,null,null,null,null,{"$f":"IF(G613=\"\",\"\",D613)","v":""},null,null,null,{"$f":"IF(K613=\"\",\"\",D613)","v":""},null,null,null,{"$f":"IF(O613=\"\",\"\",D613)","v":""},null,null,null,{"$f":"IF(S613=\"\",\"\",D613)","v":""},null,null,null,{"$f":"IF(W613=\"\",\"\",D613)","v":""}]
[null,null,null,null,null,null,null,"",null,null,null,"",null,null,null,"",null,null,null,"",null,null,null,""]
[null,null,null,null,null,null,null,"",null,null,null,"",null,null,null,"",null,null,null,"",null,null,null,""]
[null,null,null,null,null,null,null,"",null,null,null,"",null,null,null,"",null,null,null,"",null,null,null,""]
[null,null,null,null,null,null,null,"",null,null,null,"",null,null,null,"",null,null,null,"",null,null,null,""]
[null,null,null,null,null,null,null,"",null,null,null,"",null,null,null,"",null,null,null,"",null,null,null,""]
[null,null,null,null,null,null,null,"",null,null,null,"",null,null,null,"",null,null,null,"",null,null,null,""]
[null,null,null,null,null,null,null,"",null,null,null,"",null,null,null,"",null,null,null,"",null,null,null,""]
[null,null,null,null,null,null,null,"",null,null,null,"",null,null,null,"",null,null,null,"",null,null,null,""]
[null,null,null,null,null,null,null,"",null,null,null,"",null,null,null,"",null,null,null,"",null,null,null,""]
[null,null,null,null,null,null,null,"",null,null,null,"",null,null,null,"",null,null,null,"",null,null,null,""]
[null,null,null,null,null,null,null,"",null,null,null,"",null,null,null,"",null,null,null,"",null,null,null,""]
[null,null,null,null,null,null,null,"",null,null,null,"",null,null,null,"",null,null,null,"",null,null,null,""]
[null,null,null,null,null,null,null,"",null,null,null,"",null,null,null,"",null,null,null,"",null,null,null,""]
[null,null,null,null,null,null,null,"",null,null,null,"",null,null,null,"",null,null,null,"",null,null,null,""]
[null,null,null,null,null,null,null,"",null,null,null,"",null,null,null,"",null,null,null,"",null,null,null,""]
[null,null,null,null,null,null,null,"",null,null,null,"",null,null,null,"",null,null,null,"",null,null,null,""]
[null,null,null,null,null,null,null,"",null,null,null,"",null,null,null,"",null,null,null,"",null,null,null,""]
[null,null,null,null,null,null,null,"",null,null,null,"",null,null,null,"",null,null,null,"",null,null,null,""]
[null,null,null,null,null,null,null,"",null,null,null,"",null,null,null,"",null,null,null,"",null,null,null,""]
[null,null,null,null,null,null,null,"",null,null,null,"",null,null,null,"",null,null,null,"",null,null,null,""]
[null,null,null,null,null,null,null,"",null,null,null,"",null,null,null,"",null,null,null,"",null,null,null,""]
[null,null,null,null,null,null,null,"",null,null,null,"",null,null,null,"",null,null,null,"",null,null,null,""]
[null,null,null,null,null,null,null,"",null,null,null,"",null,null,null,"",null,null,null,"",null,null,null,""]
[null,null,null,null,null,null,null,"",null,null,null,"",null,null,null,"",null,null,null,"",null,null,null,""]
[null,null,null,null,null,null,null,"",null,null,null,"",null,null,null,"",null,null,null,"",null,null,null,""]
[null,null,null,null,null,null,null,"",null,null,null,"",null,null,null,"",null,null,null,"",null,null,null,""]
[null,null,null,null,null,null,null,"",null,null,null,"",null,null,null,"",null,null,null,"",null,null,null,""]
[null,null,null,null,null,null,null,"",null,null,null,"",null,null,null,"",null,null,null,"",null,null,null,""]
[null,null,null,null,null,null,null,"",null,null,null,"",null,null,null,"",null,null,null,"",null,null,null,""]
[null,null,null,null,null,null,null,"",null,null,null,"",null,null,null,"",null,null,null,"",null,null,null,""]
[null,null,null,null,null,null,null,"",null,null,null,"",null,null,null,"",null,null,null,"",null,null,null,""]
[null,null,null,null,null,null,null,"",null,null,null,"",null,null,null,"",null,null,null,"",null,null,null,""]
[null,null,null,null,null,null,null,"",null,null,null,"",null,null,null,"",null,null,null,"",null,null,null,""]
[null,null,null,null,null,null,null,"",null,null,null,"",null,null,null,"",null,null,null,"",null,null,null,""]
[null,null,null,null,null,null,null,"",null,null,null,"",null,null,null,"",null,null,null,"",null,null,null,""]
[null,null,null,null,null,null,null,"",null,null,null,"",null,null,null,"",null,null,null,"",null,null,null,""]
[null,null,null,null,null,null,null,"",null,null,null,"",null,null,null,"",null,null,null,"",null,null,null,""]
[null,null,null,null,null,null,null,"",null,null,null,"",null,null,null,"",null,null,null,"",null,null,null,""]
[null,null,null,null,null,null,null,"",null,null,null,"",null,null,null,"",null,null,null,"",null,null,null,""]
[null,null,null,null,null,null,null,"",null,null,null,"",null,null,null,"",null,null,null,"",null,null,null,""]
[null,null,null,null,null,null,null,"",null,null,null,"",null,null,null,"",null,null,null,"",null,null,null,""]
[null,null,null,null,null,null,null,"",null,null,null,"",null,null,null,"",null,null,null,"",null,null,null,""]
[null,null,null,null,null,null,null,"",null,null,null,"",null,null,null,"",null,null,null,"",null,null,null,""]
[null,null,null,null,null,null,null,"",null,null,null,"",null,null,null,"",null,null,null,"",null,null,null,""]
[null,null,null,null,null,null,null,"",null,null,null,"",null,null,null,"",null,null,null,"",null,null,null,""]
[null,null,null,null,null,null,null,"",null,null,null,"",null,null,null,"",null,null,null,"",null,null,null,""]
[null,null,null,null,null,null,null,"",null,null,null,"",null,null,null,"",null,null,null,"",null,null,null,""]
[null,null,null,null,null,null,null,"",null,null,null,"",null,null,null,"",null,null,null,"",null,null,null,""]
[null,null,null,null,null,null,null,"",null,null,null,"",null,null,null,"",null,null,null,"",null,null,null,""]
[null,null,null,null,null,null,null,"",null,null,null,"",null,null,null,"",null,null,null,"",null,null,null,""]
[null,null,null,null,null,null,null,"",null,null,null,"",null,null,null,"",null,null,null,"",null,null,null,""]
[null,null,null,null,null,null,null,"",null,null,null,"",null,null,null,"",null,null,null,"",null,null,null,""]
[null,null,null,null,null,null,null,"",null,null,null,"",null,null,null,"",null,null,null,"",null,null,null,""]
[null,null,null,null,null,null,null,"",null,null,null,"",null,null,null,"",null,null,null,"",null,null,null,""]
[null,null,null,null,null,null,null,"",null,null,null,"",null,null,null,"",null,null,null,"",null,null,null,""]
[null,null,null,null,null,null,null,"",null,null,null,"",null,null,null,"",null,null,null,"",null,null,null,""]
[null,null,null,null,null,null,null,"",null,null,null,"",null,null,null,"",null,null,null,"",null,null,null,""]
[null,null,null,null,null,null,null,"",null,null,null,"",null,null,null,"",null,null,null,"",null,null,null,""]
[null,null,null,null,null,null,null,"",null,null,null,"",null,null,null,"",null,null,null,"",null,null,null,""]
[null,null,null,null,null,null,null,"",null,null,null,"",null,null,null,"",null,null,null,"",null,null,null,""]
[null,null,null,null,null,null,null,"",null,null,null,"",null,null,null,"",null,null,null,"",null,null,null,""]
[null,null,null,null,null,null,null,"",null,null,null,"",null,null,null,"",null,null,null,"",null,null,null,""]
[null,null,null,null,null,null,null,"",null,null,null,"",null,null,null,"",null,null,null,"",null,null,null,""]
[null,null,null,null,null,null,null,{"$f":"IF(G677=\"\",\"\",D677)","v":""},null,null,null,{"$f":"IF(K677=\"\",\"\",D677)","v":""},null,null,null,{"$f":"IF(O677=\"\",\"\",D677)","v":""},null,null,null,{"$f":"IF(S677=\"\",\"\",D677)","v":""},null,null,null,{"$f":"IF(W677=\"\",\"\",D677)","v":""}]
[null,null,null,null,null,null,null,"",null,null,null,"",null,null,null,"",null,null,null,"",null,null,null,""]
[null,null,null,null,null,null,null,"",null,null,null,"",null,null,null,"",null,null,null,"",null,null,null,""]
[null,null,null,null,null,null,null,"",null,null,null,"",null,null,null,"",null,null,null,"",null,null,null,""]
[null,null,null,null,null,null,null,"",null,null,null,"",null,null,null,"",null,null,null,"",null,null,null,""]
[null,null,null,null,null,null,null,"",null,null,null,"",null,null,null,"",null,null,null,"",null,null,null,""]
[null,null,null,null,null,null,null,"",null,null,null,"",null,null,null,"",null,null,null,"",null,null,null,""]
[null,null,null,null,null,null,null,"",null,null,null,"",null,null,null,"",null,null,null,"",null,null,null,""]
[null,null,null,null,null,null,null,"",null,null,null,"",null,null,null,"",null,null,null,"",null,null,null,""]
[null,null,null,null,null,null,null,"",null,null,null,"",null,null,null,"",null,null,null,"",null,null,null,""]
[null,null,null,null,null,null,null,"",null,null,null,"",null,null,null,"",null,null,null,"",null,null,null,""]
[null,null,null,null,null,null,null,"",null,null,null,"",null,null,null,"",null,null,null,"",null,null,null,""]
[null,null,null,null,null,null,null,"",null,null,null,"",null,null,null,"",null,null,null,"",null,null,null,""]
[null,null,null,null,null,null,null,"",null,null,null,"",null,null,null,"",null,null,null,"",null,null,null,""]
[null,null,null,null,null,null,null,"",null,null,null,"",null,null,null,"",null,null,null,"",null,null,null,""]
[null,null,null,null,null,null,null,"",null,null,null,"",null,null,null,"",null,null,null,"",null,null,null,""]
[null,null,null,null,null,null,null,"",null,null,null,"",null,null,null,"",null,null,null,"",null,null,null,""]
[null,null,null,null,null,null,null,"",null,null,null,"",null,null,null,"",null,null,null,"",null,null,null,""]
[null,null,null,null,null,null,null,"",null,null,null,"",null,null,null,"",null,null,null,"",null,null,null,""]
[null,null,null,null,null,null,null,"",null,null,null,"",null,null,null,"",null,null,null,"",null,null,null,""]
[null,null,null,null,null,null,null,"",null,null,null,"",null,null,null,"",null,null,null,"",null,null,null,""]
[null,null,null,null,null,null,null,"",null,null,null,"",null,null,null,"",null,null,null,"",null,null,null,""]
[null,null,null,null,null,null,null,"",null,null,null,"",null,null,null,"",null,null,null,"",null,null,null,""]
[null,null,null,null,null,null,null,"",null,null,null,"",null,null,null,"",null,null,null,"",null,null,null,""]
[null,null,null,null,null,null,null,"",null,null,null,"",null,null,null,"",null,null,null,"",null,null,null,""]
[null,null,null,null,null,null,null,"",null,null,null,"",null,null,null,"",null,null,null,"",null,null,null,""]
[null,null,null,null,null,null,null,"",null,null,null,"",null,null,null,"",null,null,null,"",null,null,null,""]
[null,null,null,null,null,null,null,"",null,null,null,"",null,null,null,"",null,null,null,"",null,null,null,""]
[null,null,null,null,null,null,null,"",null,null,null,"",null,null,null,"",null,null,null,"",null,null,null,""]
[null,null,null,null,null,null,null,"",null,null,null,"",null,null,null,"",null,null,null,"",null,null,null,""]
[null,null,null,null,null,null,null,"",null,null,null,"",null,null,null,"",null,null,null,"",null,null,null,""]
[null,null,null,null,null,null,null,"",null,null,null,"",null,null,null,"",null,null,null,"",null,null,null,""]
[null,null,null,null,null,null,null,"",null,null,null,"",null,null,null,"",null,null,null,"",null,null,null,""]
[null,null,null,null,null,null,null,"",null,null,null,"",null,null,null,"",null,null,null,"",null,null,null,""]
[null,null,null,null,null,null,null,"",null,null,null,"",null,null,null,"",null,null,null,"",null,null,null,""]
[null,null,null,null,null,null,null,"",null,null,null,"",null,null,null,"",null,null,null,"",null,null,null,""]
[null,null,null,null,null,null,null,"",null,null,null,"",null,null,null,"",null,null,null,"",null,null,null,""]
[null,null,null,null,null,null,null,"",null,null,null,"",null,null,null,"",null,null,null,"",null,null,null,""]
[null,null,null,null,null,null,null,"",null,null,null,"",null,null,null,"",null,null,null,"",null,null,null,""]
[null,null,null,null,null,null,null,"",null,null,null,"",null,null,null,"",null,null,null,"",null,null,null,""]
[null,null,null,null,null,null,null,"",null,null,null,"",null,null,null,"",null,null,null,"",null,null,null,""]
[null,null,null,null,null,null,null,"",null,null,null,"",null,null,null,"",null,null,null,"",null,null,null,""]
[null,null,null,null,null,null,null,"",null,null,null,"",null,null,null,"",null,null,null,"",null,null,null,""]
[null,null,null,null,null,null,null,"",null,null,null,"",null,null,null,"",null,null,null,"",null,null,null,""]
[null,null,null,null,null,null,null,"",null,null,null,"",null,null,null,"",null,null,null,"",null,null,null,""]
[null,null,null,null,null,null,null,"",null,null,null,"",null,null,null,"",null,null,null,"",null,null,null,""]
[null,null,null,null,null,null,null,"",null,null,null,"",null,null,null,"",null,null,null,"",null,null,null,""]
[null,null,null,null,null,null,null,"",null,null,null,"",null,null,null,"",null,null,null,"",null,null,null,""]
[null,null,null,null,null,null,null,"",null,null,null,"",null,null,null,"",null,null,null,"",null,null,null,""]
[null,null,null,null,null,null,null,"",null,null,null,"",null,null,null,"",null,null,null,"",null,null,null,""]
[null,null,null,null,null,null,null,"",null,null,null,"",null,null,null,"",null,null,null,"",null,null,null,""]
[null,null,null,null,null,null,null,"",null,null,null,"",null,null,null,"",null,null,null,"",null,null,null,""]
[null,null,null,null,null,null,null,"",null,null,null,"",null,null,null,"",null,null,null,"",null,null,null,""]
[null,null,null,null,null,null,null,"",null,null,null,"",null,null,null,"",null,null,null,"",null,null,null,""]
[null,null,null,null,null,null,null,"",null,null,null,"",null,null,null,"",null,null,null,"",null,null,null,""]
[null,null,null,null,null,null,null,"",null,null,null,"",null,null,null,"",null,null,null,"",null,null,null,""]
[null,null,null,null,null,null,null,"",null,null,null,"",null,null,null,"",null,null,null,"",null,null,null,""]
[null,null,null,null,null,null,null,"",null,null,null,"",null,null,null,"",null,null,null,"",null,null,null,""]
[null,null,null,null,null,null,null,"",null,null,null,"",null,null,null,"",null,null,null,"",null,null,null,""]
[null,null,null,null,null,null,null,"",null,null,null,"",null,null,null,"",null,null,null,"",null,null,null,""]
[null,null,null,null,null,null,null,"",null,null,null,"",null,null,null,"",null,null,null,"",null,null,null,""]
[null,null,null,null,null,null,null,"",null,null,null,"",null,null,null,"",null,null,null,"",null,null,null,""]
[null,null,null,null,null,null,null,"",null,null,null,"",null,null,null,"",null,null,null,"",null,null,null,""]
[null,null,null,null,null,null,null,"",null,null,null,"",null,null,null,"",null,null,null,"",null,null,null,""]
[null,null,null,null,null,null,null,{"$f":"IF(G741=\"\",\"\",D741)","v":""},null,null,null,{"$f":"IF(K741=\"\",\"\",D741)","v":""},null,null,null,{"$f":"IF(O741=\"\",\"\",D741)","v":""},null,null,null,{"$f":"IF(S741=\"\",\"\",D741)","v":""},null,null,null,{"$f":"IF(W741=\"\",\"\",D741)","v":""}]
[null,null,null,null,null,null,null,"",null,null,null,"",null,null,null,"",null,null,null,"",null,null,null,""]
[null,null,null,null,null,null,null,"",null,null,null,"",null,null,null,"",null,null,null,"",null,null,null,""]
[null,null,null,null,null,null,null,"",null,null,null,"",null,null,null,"",null,null,null,"",null,null,null,""]
[null,null,null,null,null,null,null,"",null,null,null,"",null,null,null,"",null,null,null,"",null,null,null,""]
[null,null,null,null,null,null,null,"",null,null,null,"",null,null,null,"",null,null,null,"",null,null,null,""]
[null,null,null,null,null,null,null,"",null,null,null,"",null,null,null,"",null,null,null,"",null,null,null,""]
[null,null,null,null,null,null,null,"",null,null,null,"",null,null,null,"",null,null,null,"",null,null,null,""]
[null,null,null,null,null,null,null,"",null,null,null,"",null,null,null,"",null,null,null,"",null,null,null,""]
[null,null,null,null,null,null,null,"",null,null,null,"",null,null,null,"",null,null,null,"",null,null,null,""]
[null,null,null,null,null,null,null,"",null,null,null,"",null,null,null,"",null,null,null,"",null,null,null,""]
[null,null,null,null,null,null,null,"",null,null,null,"",null,null,null,"",null,null,null,"",null,null,null,""]
[null,null,null,null,null,null,null,"",null,null,null,"",null,null,null,"",null,null,null,"",null,null,null,""]
[null,null,null,null,null,null,null,"",null,null,null,"",null,null,null,"",null,null,null,"",null,null,null,""]
[null,null,null,null,null,null,null,"",null,null,null,"",null,null,null,"",null,null,null,"",null,null,null,""]
[null,null,null,null,null,null,null,"",null,null,null,"",null,null,null,"",null,null,null,"",null,null,null,""]
[null,null,null,null,null,null,null,"",null,null,null,"",null,null,null,"",null,null,null,"",null,null,null,""]
[null,null,null,null,null,null,null,"",null,null,null,"",null,null,null,"",null,null,null,"",null,null,null,""]
[null,null,null,null,null,null,null,"",null,null,null,"",null,null,null,"",null,null,null,"",null,null,null,""]
[null,null,null,null,null,null,null,"",null,null,null,"",null,null,null,"",null,null,null,"",null,null,null,""]
[null,null,null,null,null,null,null,"",null,null,null,"",null,null,null,"",null,null,null,"",null,null,null,""]
[null,null,null,null,null,null,null,"",null,null,null,"",null,null,null,"",null,null,null,"",null,null,null,""]
[null,null,null,null,null,null,null,"",null,null,null,"",null,null,null,"",null,null,null,"",null,null,null,""]
[null,null,null,null,null,null,null,"",null,null,null,"",null,null,null,"",null,null,null,"",null,null,null,""]
[null,null,null,null,null,null,null,"",null,null,null,"",null,null,null,"",null,null,null,"",null,null,null,""]
[null,null,null,null,null,null,null,"",null,null,null,"",null,null,null,"",null,null,null,"",null,null,null,""]